program: Orca
programVersion: 4.2.1
elementType: Cl F F F F F F O N N C C C C C C C C C C C C C C C C H H H H H H H H H H H
charge: 0
multiplicity: 1
keywords: wb97x-d3
keywords: def2-TZVPP
keywords: def2/J RIJCOSX GRIDX6 NOFINALGRIDX
keywords: grid4 nofinalgrid
keywords: scfconv7
keywords: smallprint printgap noloewdin
keywords: NOSOSCF
formula: C16H11ClF6N2O
InChI: InChI=1/C16H11ClF6N2O/c17-12-7-9(15(18,19)20)8-25-13(12)5-6-24-14(26)10-3-1-2-4-11(10)16(21,22)23/h1-4,7-8,24H,5-6H2
37 atoms
Cl -1.606731 -2.755622 -0.124862
F  4.669382 -1.817539 -1.179597
F  2.922276 -1.309673 -0.040358
F  3.232049 -0.444935 -1.98912
F  -6.529641 1.012104 0.662403
F  -6.537813 -0.122956 -1.164542
F  -6.553474 -1.142162 0.727722
O  2.089656 1.13685 2.028457
N  1.661058 1.475647 -0.165472
N  -2.492928 1.080246 0.045427
C  -0.316469 0.020175 -0.068208
C  0.220008 1.448022 -0.049783
C  -1.811961 -0.053667 -0.019402
C  3.947413 1.283214 0.560047
C  2.476743 1.262587 0.888197
C  4.59847 0.33644 -0.233497
C  -2.487721 -1.279266 -0.041278
C  -4.552758 -0.107578 0.07562
C  -3.865473 -1.311227 0.00454
C  4.691728 2.302531 1.142652
C  5.966325 0.446319 -0.458429
C  -3.814784 1.06436 0.092681
C  3.855135 -0.812331 -0.854562
C  6.050889 2.414693 0.906595
C  6.688681 1.486608 0.099634
C  -6.049395 -0.088024 0.080126
H  0.041812 -0.500854 -0.961283
H  0.099343 -0.533164 0.778451
H  -0.196667 2.027161 -0.872735
H  -0.074797 1.953122 0.868529
H  2.064263 1.584752 -1.079226
H  -4.384378 -2.260367 -0.009552
H  4.19314 3.014226 1.787278
H  6.481087 -0.286992 -1.06278
H  -4.298152 2.032154 0.150956
H  6.611716 3.221415 1.359208
H  7.751236 1.561557 -0.08663
totalener: -1860.55120897 hartree
nucrepener: 2479.55550889 hartree
electener: -4340.10671786 hartree
oneelecener: -7492.21502497 hartree
twoeener: 3152.10830711 hartree
kineticenergy: 1854.82881679 hartree
xcener: -144.347644406760 hartree
chargesum: -0.0000000
charge: -0.050741 -0.167550 -0.163680 -0.184603 -0.168703 -0.164624 -0.170145 -0.379410 -0.211626 -0.318991 -0.120658 -0.023806 0.210765 0.073269 0.323847 -0.204703 -0.018027 -0.070536 -0.097539 -0.166699 -0.067198 -0.025043 0.538214 -0.113979 -0.129959 0.540334 0.085913 0.115552 0.096107 0.101627 0.148880 0.128766 0.130638 0.132690 0.122364 0.134919 0.134334
qa: -0.0507 -0.1675 -0.1637 -0.1846 -0.1687 -0.1646 -0.1701 -0.3794 -0.2116 -0.3190 -0.1207 -0.0238 0.2108 0.0733 0.3238 -0.2047 -0.0180 -0.0705 -0.0975 -0.1667 -0.0672 -0.0250 0.5382 -0.1140 -0.1300 0.5403 0.0859 0.1156 0.0961 0.1016 0.1489 0.1288 0.1306 0.1327 0.1224 0.1349 0.1343
va: 1.2753 1.1396 1.1393 1.0997 1.1382 1.1293 1.1342 2.1383 3.1415 3.0281 3.8418 3.8618 3.7096 3.6819 4.1798 3.9165 4.1156 3.7460 4.0809 4.0274 3.9326 4.1434 4.4479 3.9530 3.9654 4.4355 1.0206 1.0196 1.0219 1.0286 1.0311 1.0257 1.0147 1.0139 1.0140 0.9984 0.9999
dispcorr: -0.018041743 hartree
energy: -1860.569250716295
dipole: 27.46175 -26.29674 1.16501 18.38605 -17.70903 0.67702 3.81368 -4.74575 -0.93208
magnitude: 1.63840 au
magnitude: 4.16449 debye
