program: Orca
programVersion: 4.2.1
elementType: F F F O N N N C C C C C C C C C C C C C C C C C C H H H H H H H H H H H H H H H H H H H H
charge: 0
multiplicity: 1
keywords: wb97x-d3
keywords: def2-TZVPP
keywords: def2/J RIJCOSX GRIDX6 NOFINALGRIDX
keywords: grid4 nofinalgrid
keywords: scfconv7
keywords: smallprint printgap noloewdin
keywords: NOSOSCF
formula: C18H20F3N3O
InChI: InChI=1/C18H20F3N3O/c1-9-7-18(2,3)14-11(19)5-6-12(13(9)14)22-17(25)10-8-24(4)23-15(10)16(20)21/h5-6,8-9,16,22H,7H2,1-4H3
45 atoms
F  5.026464 1.866174 0.021923
F  -5.601107 1.555257 -0.944036
F  -3.884656 1.291557 -2.262469
O  -1.304543 1.622879 -0.728124
N  -0.181974 0.108413 0.53528
N  -4.03929 -1.578879 0.862986
N  -4.7280 -0.637203 0.226988
C  4.446287 -1.091003 0.127689
C  3.512182 -2.268701 0.502996
C  2.062499 -1.830342 0.231728
C  3.492147 0.081667 0.197263
C  2.167612 -0.328222 0.288453
C  5.597473 -0.988346 1.127667
C  5.012189 -1.239193 -1.287819
C  1.511165 -2.304205 -1.113337
C  1.127696 0.593433 0.374629
C  3.757413 1.435492 0.145935
C  1.429671 1.953099 0.355217
C  2.745931 2.372927 0.226925
C  -1.300891 0.611368 -0.040551
C  -2.536018 -0.133757 0.220535
C  -3.836775 0.241927 -0.174685
C  -2.728996 -1.325667 0.893053
C  -4.247863 1.441719 -0.956019
C  -4.717336 -2.690216 1.495015
H  3.621637 -2.478968 1.569217
H  3.777504 -3.184046 -0.029531
H  1.408809 -2.216822 1.020443
H  6.148198 -1.930642 1.15676
H  6.308329 -0.205878 0.863636
H  5.232397 -0.789103 2.136449
H  5.65746 -2.117878 -1.348326
H  4.225991 -1.35473 -2.03462
H  5.610348 -0.371426 -1.569781
H  0.49488 -1.94529 -1.283644
H  1.484385 -3.393755 -1.152511
H  2.123206 -1.954991 -1.945337
H  0.653655 2.696185 0.456072
H  2.980081 3.429145 0.206084
H  -0.260614 -0.760664 1.039753
H  -2.044974 -2.002206 1.380838
H  -3.81973 2.36994 -0.582889
H  -5.710832 -2.780678 1.068569
H  -4.167458 -3.608912 1.310675
H  -4.800101 -2.529602 2.568005
elementType: F O N C H
totalener: -1237.13611566 hartree
nucrepener: 2236.36366803 hartree
electener: -3473.49978369 hartree
oneelecener: -6136.63026669 hartree
twoeener: 2663.13048300 hartree
cpcmener: -0.04455018 hartree
kineticenergy: 1232.16100420 hartree
xcener: -115.110410662749 hartree
chargesum: 0.0000000
charge: -0.232540 -0.216472 -0.221381 -0.522735 -0.181181 0.113915 -0.306667 0.288550 -0.233524 0.096420 -0.218815 -0.105214 -0.335133 -0.333599 -0.301589 0.136142 0.309244 -0.187018 -0.201790 0.409947 -0.148150 0.007547 0.001130 0.293340 -0.150293 0.092365 0.083901 0.066924 0.105238 0.095247 0.099349 0.100248 0.108658 0.095938 0.085549 0.097433 0.099385 0.143391 0.148026 0.181301 0.161739 0.105496 0.114280 0.125369 0.130025
qa: -0.2325 -0.2165 -0.2214 -0.5227 -0.1812 0.1139 -0.3067 0.2886 -0.2335 0.0964 -0.2188 -0.1052 -0.3351 -0.3336 -0.3016 0.1361 0.3092 -0.1870 -0.2018 0.4099 -0.1482 0.0075 0.0011 0.2933 -0.1503 0.0924 0.0839 0.0669 0.1052 0.0952 0.0993 0.1002 0.1087 0.0959 0.0855 0.0974 0.0994 0.1434 0.1480 0.1813 0.1617 0.1055 0.1143 0.1254 0.1300
va: 1.0511 1.0596 1.0332 1.9896 3.2666 3.4079 2.9474 3.7187 4.0207 3.8447 3.6117 3.8448 3.9023 3.9128 3.9164 3.6864 3.8833 3.9788 3.9675 4.1390 3.6067 3.9471 4.0068 4.2463 3.8677 1.0085 1.0099 1.0118 1.0001 1.0141 0.9999 1.0010 1.0007 1.0100 1.0126 1.0032 0.9999 1.0207 1.0015 1.0085 0.9998 0.9904 1.0062 0.9911 0.9863
dispcorr: -0.022661490 hartree
energy: -1237.158777146564
dipole: 30.81811 -29.98232 0.83578 -27.70185 24.03596 -3.66589 8.07767 -5.21656 2.86111
magnitude: 4.72475 au
magnitude: 12.00935 debye
