program: Orca
programVersion: 4.2.1
elementType: F F F O N N N C C C C C C C C C C C C C C C C C C H H H H H H H H H H H H H H H H H H H H
charge: 0
multiplicity: 1
keywords: wb97x-d3
keywords: def2-TZVPP
keywords: def2/J RIJCOSX GRIDX6 NOFINALGRIDX
keywords: grid4 nofinalgrid
keywords: scfconv7
keywords: smallprint printgap noloewdin
keywords: NOSOSCF
formula: C18H20F3N3O
InChI: InChI=1/C18H20F3N3O/c1-9-7-18(2,3)14-11(19)5-6-12(13(9)14)22-17(25)10-8-24(4)23-15(10)16(20)21/h5-6,8-9,16,22H,7H2,1-4H3
45 atoms
F  5.052445 1.822123 0.203132
F  -5.666524 1.726398 -0.337489
F  -4.138708 1.669936 -1.894396
O  -1.369551 1.776598 -0.476616
N  -0.171909 0.046528 0.381117
N  -3.993043 -1.712159 0.629629
N  -4.724768 -0.674551 0.238816
C  4.45495 -1.124855 -0.007166
C  3.504398 -2.329159 0.209058
C  2.065527 -1.853804 -0.056264
C  3.503463 0.04183 0.145095
C  2.175508 -0.36465 0.15048
C  5.566819 -1.136501 1.041028
C  5.073649 -1.130269 -1.408206
C  1.552503 -2.196751 -1.455211
C  1.134884 0.551628 0.295639
C  3.777111 1.39199 0.237433
C  1.444015 1.905187 0.414291
C  2.767052 2.323414 0.372222
C  -1.32252 0.648604 -0.005018
C  -2.538699 -0.146994 0.186714
C  -3.863632 0.280342 -0.03759
C  -2.684552 -1.450684 0.622496
C  -4.329998 1.600799 -0.54381
C  -4.621646 -2.941129 1.066203
H  3.581233 -2.659155 1.247258
H  3.781213 -3.181089 -0.415082
H  1.389787 -2.311259 0.674462
H  6.295224 -0.341322 0.885176
H  5.163975 -1.035588 2.05001
H  6.106648 -2.084457 0.995436
H  4.314744 -1.14593 -2.191029
H  5.697809 -0.250276 -1.570739
H  5.705116 -2.010962 -1.540823
H  2.200344 -1.789632 -2.232131
H  0.548912 -1.806144 -1.630213
H  1.509876 -3.278214 -1.5895
H  0.672598 2.645166 0.556706
H  3.004427 3.375362 0.461217
H  -0.23432 -0.904185 0.709151
H  -1.969668 -2.199752 0.92484
H  -3.82731 2.447307 -0.082037
H  -4.094264 -3.792453 0.645093
H  -4.611533 -3.012017 2.151627
H  -5.647974 -2.950873 0.715332
elementType: F O N C H
totalener: -1237.13598052 hartree
nucrepener: 2232.39569807 hartree
electener: -3469.53167859 hartree
oneelecener: -6128.50549463 hartree
twoeener: 2658.97381604 hartree
cpcmener: -0.04367650 hartree
kineticenergy: 1232.15894992 hartree
xcener: -115.110645469209 hartree
chargesum: -0.0000000
charge: -0.233112 -0.216296 -0.222567 -0.526413 -0.175855 0.114746 -0.307465 0.294505 -0.233882 0.077926 -0.216598 -0.105339 -0.335194 -0.334268 -0.295930 0.139891 0.303706 -0.188131 -0.204045 0.427485 -0.149315 0.005941 -0.003050 0.293613 -0.149697 0.092955 0.083909 0.068993 0.094701 0.099602 0.105136 0.107684 0.095811 0.100306 0.099853 0.083095 0.098111 0.145244 0.147920 0.183305 0.160215 0.102528 0.126175 0.130007 0.113794
qa: -0.2331 -0.2163 -0.2226 -0.5264 -0.1759 0.1147 -0.3075 0.2945 -0.2339 0.0779 -0.2166 -0.1053 -0.3352 -0.3343 -0.2959 0.1399 0.3037 -0.1881 -0.2040 0.4275 -0.1493 0.0059 -0.0031 0.2936 -0.1497 0.0930 0.0839 0.0690 0.0947 0.0996 0.1051 0.1077 0.0958 0.1003 0.0999 0.0831 0.0981 0.1452 0.1479 0.1833 0.1602 0.1025 0.1262 0.1300 0.1138
va: 1.0501 1.0597 1.0326 1.9841 3.2744 3.4105 2.9490 3.7100 4.0198 3.8534 3.6112 3.8338 3.9030 3.9140 3.9173 3.7095 3.8851 3.9678 3.9741 4.1216 3.6083 3.9461 4.0108 4.2443 3.8668 1.0084 1.0098 1.0117 1.0143 0.9998 1.0000 1.0007 1.0099 1.0011 1.0000 1.0137 1.0031 1.0249 1.0017 1.0085 1.0006 0.9930 0.9907 0.9863 1.0066
dispcorr: -0.022559765 hartree
energy: -1237.158540281576
dipole: 31.85504 -30.81536 1.03968 -29.34774 25.18912 -4.15861 3.19647 -1.17488 2.02159
magnitude: 4.73939 au
magnitude: 12.04657 debye
