program: Orca
programVersion: 4.2.1
elementType: F F F O N N N C C C C C C C C C C C C C C C C C C H H H H H H H H H H H H H H H H H H H H
charge: 0
multiplicity: 1
keywords: wb97x-d3
keywords: def2-TZVPP
keywords: def2/J RIJCOSX GRIDX6 NOFINALGRIDX
keywords: grid4 nofinalgrid
keywords: scfconv7
keywords: smallprint printgap noloewdin
keywords: NOSOSCF
formula: C18H20F3N3O
InChI: InChI=1/C18H20F3N3O/c1-9-7-18(2,3)14-11(19)5-6-12(13(9)14)22-17(25)10-8-24(4)23-15(10)16(20)21/h5-6,8-9,16,22H,7H2,1-4H3
45 atoms
F  4.918221 1.833044 -0.10539
F  -3.503887 0.17875 -2.797912
F  -4.283079 1.928095 -1.749976
O  -1.407614 1.494093 -1.085046
N  -0.328023 0.199539 0.437162
N  -4.215584 -1.153932 1.258878
N  -4.823684 -0.718102 0.16537
C  4.304201 -1.040165 0.567365
C  3.341668 -2.119089 1.123945
C  1.911019 -1.748529 0.69402
C  3.357689 0.119587 0.342569
C  2.026255 -0.266988 0.437371
C  5.404099 -0.735331 1.58388
C  4.940244 -1.472572 -0.75748
C  1.419815 -2.504464 -0.540399
C  0.989839 0.64841 0.263336
C  3.639724 1.433505 0.02703
C  1.307453 1.974665 -0.02494
C  2.633348 2.362127 -0.153263
C  -1.433604 0.632784 -0.225614
C  -2.684573 -0.025561 0.180772
C  -3.921584 -0.028542 -0.500109
C  -2.937716 -0.76643 1.318836
C  -4.333991 0.570599 -1.795786
C  -4.939916 -1.910379 2.255743
H  3.395179 -2.112135 2.215155
H  3.625341 -3.122942 0.800653
H  1.217283 -1.958648 1.515565
H  6.140739 -0.028896 1.201398
H  4.992348 -0.32621 2.508194
H  5.939124 -1.652538 1.840028
H  4.192041 -1.727587 -1.508944
H  5.568421 -0.683689 -1.174433
H  5.571618 -2.351178 -0.608645
H  2.079119 -2.352229 -1.3954
H  0.419735 -2.187652 -0.840476
H  1.375461 -3.576218 -0.340443
H  0.53519 2.719497 -0.140179
H  2.878055 3.391344 -0.382212
H  -0.431279 -0.605363 1.034176
H  -2.316515 -1.023345 2.162932
H  -5.352605 0.274083 -2.051878
H  -4.370535 -2.791144 2.542656
H  -5.128187 -1.300419 3.137394
H  -5.887346 -2.224046 1.829163
elementType: F O N C H
totalener: -1237.14452449 hartree
nucrepener: 2246.49579837 hartree
electener: -3483.64032286 hartree
oneelecener: -6157.29055347 hartree
twoeener: 2673.65023061 hartree
cpcmener: -0.03808968 hartree
kineticenergy: 1232.15783309 hartree
xcener: -115.106698231082 hartree
chargesum: -0.0000000
charge: -0.231630 -0.219862 -0.218793 -0.468456 -0.186505 0.104439 -0.294902 0.290081 -0.226611 0.077647 -0.218583 -0.090261 -0.333693 -0.336165 -0.296850 0.123596 0.306651 -0.173724 -0.203634 0.379201 -0.172554 -0.007070 -0.013370 0.336619 -0.152701 0.091293 0.083427 0.065056 0.095570 0.098175 0.104863 0.108983 0.097240 0.099255 0.099766 0.085294 0.095939 0.142175 0.144524 0.173604 0.169181 0.103789 0.125738 0.128589 0.114666
qa: -0.2316 -0.2199 -0.2188 -0.4685 -0.1865 0.1044 -0.2949 0.2901 -0.2266 0.0776 -0.2186 -0.0903 -0.3337 -0.3362 -0.2968 0.1236 0.3067 -0.1737 -0.2036 0.3792 -0.1726 -0.0071 -0.0134 0.3366 -0.1527 0.0913 0.0834 0.0651 0.0956 0.0982 0.1049 0.1090 0.0972 0.0993 0.0998 0.0853 0.0959 0.1422 0.1445 0.1736 0.1692 0.1038 0.1257 0.1286 0.1147
va: 1.0524 1.0524 1.0501 2.0486 3.2565 3.4026 2.9495 3.7171 4.0089 3.8515 3.6088 3.8091 3.9030 3.9157 3.9179 3.7251 3.8824 3.9774 3.9718 4.1953 3.6656 4.0238 3.9999 4.1862 3.8665 1.0088 1.0099 1.0102 1.0143 1.0006 0.9996 1.0004 1.0100 1.0012 1.0001 1.0129 1.0034 1.0211 1.0026 1.0124 0.9966 0.9944 0.9896 0.9864 1.0076
dispcorr: -0.022587626 hartree
energy: -1237.167112115789
dipole: 25.66059 -26.11192 -0.45133 -25.49310 22.30341 -3.18970 16.32589 -12.89043 3.43546
magnitude: 4.70959 au
magnitude: 11.97084 debye
