program: Orca
programVersion: 4.2.1
elementType: F F F O N N N C C C C C C C C C C C C C C C C C C H H H H H H H H H H H H H H H H H H H H
charge: 0
multiplicity: 1
keywords: wb97x-d3
keywords: def2-TZVPP
keywords: def2/J RIJCOSX GRIDX6 NOFINALGRIDX
keywords: grid4 nofinalgrid
keywords: scfconv7
keywords: smallprint printgap noloewdin
keywords: NOSOSCF
formula: C18H20F3N3O
InChI: InChI=1/C18H20F3N3O/c1-9-7-18(2,3)14-11(19)5-6-12(13(9)14)22-17(25)10-8-24(4)23-15(10)16(20)21/h5-6,8-9,16,22H,7H2,1-4H3
45 atoms
F  4.995037 2.072078 0.397044
F  -4.180083 -2.606244 1.649887
F  -3.916021 -0.861807 2.929189
O  -0.574096 -0.537651 1.117186
N  -0.372763 1.090358 -0.436704
N  -4.497278 0.425253 -0.912676
N  -4.701098 -0.417642 0.089194
C  4.15683 -0.673269 -0.495599
C  3.200612 -1.51863 -1.355905
C  1.76715 -1.109934 -0.985276
C  3.310943 0.56193 -0.26769
C  1.956994 0.307144 -0.495426
C  4.423862 -1.35166 0.852425
C  5.474483 -0.430151 -1.225853
C  0.814798 -1.297667 -2.159678
C  1.011568 1.301088 -0.257329
C  3.696555 1.815517 0.159294
C  1.437256 2.562663 0.151278
C  2.780291 2.832698 0.349764
C  -1.086285 0.190662 0.280276
C  -2.524034 0.136382 -0.022912
C  -3.521382 -0.610373 0.639955
C  -3.217138 0.786131 -1.027769
C  -3.411587 -1.498015 1.831108
C  -5.594651 0.851882 -1.753121
H  3.373917 -2.589901 -1.23589
H  3.369842 -1.281932 -2.411773
H  1.410729 -1.719181 -0.147724
H  3.497527 -1.613134 1.367814
H  4.995656 -2.271796 0.712292
H  4.999118 -0.704537 1.517137
H  5.332344 0.175171 -2.122835
H  6.217723 0.062084 -0.59931
H  5.90158 -1.385113 -1.539817
H  0.900602 -2.316711 -2.541995
H  1.058706 -0.618602 -2.978956
H  -0.231433 -1.146928 -1.900702
H  0.706347 3.342294 0.32597
H  3.106215 3.81354 0.670532
H  -0.865803 1.778856 -0.983832
H  -2.894131 1.455058 -1.80994
H  -2.393902 -1.809671 2.049549
H  -5.71275 1.932065 -1.701458
H  -5.418109 0.55772 -2.785452
H  -6.50316 0.377148 -1.397172
elementType: F O N C H
totalener: -1237.14587547 hartree
nucrepener: 2254.34865913 hartree
electener: -3491.49453460 hartree
oneelecener: -6173.07249561 hartree
twoeener: 2681.57796101 hartree
cpcmener: -0.03699124 hartree
kineticenergy: 1232.14898511 hartree
xcener: -115.104750836494 hartree
chargesum: -0.0000000
charge: -0.228002 -0.218280 -0.221513 -0.499140 -0.157693 0.115506 -0.305798 0.361667 -0.283364 0.147082 -0.233870 -0.083767 -0.319969 -0.339824 -0.331719 0.086691 0.325201 -0.179969 -0.205363 0.349458 -0.112046 -0.002865 -0.009180 0.261415 -0.155218 0.085759 0.082386 0.076880 0.103200 0.097933 0.097191 0.099896 0.094784 0.103900 0.100680 0.089388 0.095596 0.144465 0.146052 0.173622 0.167209 0.111063 0.128478 0.128285 0.113787
qa: -0.2280 -0.2183 -0.2215 -0.4991 -0.1577 0.1155 -0.3058 0.3617 -0.2834 0.1471 -0.2339 -0.0838 -0.3200 -0.3398 -0.3317 0.0867 0.3252 -0.1800 -0.2054 0.3495 -0.1120 -0.0029 -0.0092 0.2614 -0.1552 0.0858 0.0824 0.0769 0.1032 0.0979 0.0972 0.0999 0.0948 0.1039 0.1007 0.0894 0.0956 0.1445 0.1461 0.1736 0.1672 0.1111 0.1285 0.1283 0.1138
va: 1.0581 1.0521 1.0431 2.0176 3.1901 3.4030 2.9674 3.6298 4.0319 3.6965 3.6796 3.8505 3.9254 3.9019 3.9567 3.6878 3.8661 3.9985 3.9596 4.1601 3.5457 3.9211 4.0063 4.2214 3.8654 1.0133 1.0078 1.0251 1.0008 1.0018 1.0081 1.0002 1.0138 1.0004 1.0024 1.0006 1.0059 1.0057 1.0013 1.0100 0.9968 1.0071 0.9875 0.9877 1.0086
dispcorr: -0.023009808 hartree
energy: -1237.168885277994
dipole: 22.59584 -23.07234 -0.47650 -2.90877 5.00468 2.09591 -21.38054 18.06223 -3.31831
magnitude: 3.95362 au
magnitude: 10.04929 debye
