program: Orca
programVersion: 4.2.1
elementType: F F F O N N N C C C C C C C C C C C C C C C C C C H H H H H H H H H H H H H H H H H H H H
charge: 0
multiplicity: 1
keywords: wb97x-d3
keywords: def2-TZVPP
keywords: def2/J RIJCOSX GRIDX6 NOFINALGRIDX
keywords: grid4 nofinalgrid
keywords: scfconv7
keywords: smallprint printgap noloewdin
keywords: NOSOSCF
formula: C18H20F3N3O
InChI: InChI=1/C18H20F3N3O/c1-9-7-18(2,3)14-11(19)5-6-12(13(9)14)22-17(25)10-8-24(4)23-15(10)16(20)21/h5-6,8-9,16,22H,7H2,1-4H3
45 atoms
F  5.033565 1.864031 0.069053
F  -5.633303 1.537616 -0.921634
F  -3.936618 1.25261 -2.262929
O  -1.344198 1.672268 -0.678959
N  -0.180381 0.091944 0.461692
N  -4.042201 -1.563422 0.904575
N  -4.736756 -0.634646 0.259113
C  4.452979 -1.094387 0.142287
C  3.511354 -2.276242 0.485531
C  2.066978 -1.835438 0.190224
C  3.496433 0.077464 0.19973
C  2.170596 -0.33308 0.259437
C  5.58156 -1.002425 1.169005
C  5.050446 -1.228892 -1.261721
C  1.539112 -2.301808 -1.166953
C  1.126625 0.587203 0.327048
C  3.762402 1.431744 0.16012
C  1.428332 1.947468 0.312966
C  2.747559 2.366868 0.216892
C  -1.318049 0.631753 -0.041753
C  -2.547889 -0.119719 0.236978
C  -3.853235 0.245497 -0.155465
C  -2.732576 -1.304282 0.924985
C  -4.280283 1.42907 -0.955298
C  -4.715785 -2.677663 1.53376
H  3.599549 -2.499232 1.551501
H  3.787667 -3.186412 -0.050977
H  1.40012 -2.228994 0.965226
H  6.129274 -1.946761 1.205389
H  6.302037 -0.221266 0.927405
H  5.19581 -0.808001 2.171353
H  5.693966 -2.109437 -1.320342
H  4.281385 -1.330996 -2.028304
H  5.658667 -0.360772 -1.520861
H  0.528037 -1.937272 -1.356403
H  1.507009 -3.39148 -1.212238
H  2.168064 -1.952773 -1.986568
H  0.650629 2.691598 0.38828
H  2.980724 3.423709 0.200383
H  -0.253972 -0.791078 0.940952
H  -2.04416 -1.969851 1.422481
H  -3.849222 2.366342 -0.609279
H  -5.734062 -2.718721 1.160725
H  -4.209537 -3.607411 1.28622
H  -4.734867 -2.554709 2.615071
elementType: F O N C H
totalener: -1237.14474553 hartree
nucrepener: 2233.88280217 hartree
electener: -3471.02754771 hartree
oneelecener: -6131.55157418 hartree
twoeener: 2660.52402648 hartree
cpcmener: -0.03648476 hartree
kineticenergy: 1232.15424160 hartree
xcener: -115.108120433101 hartree
chargesum: -0.0000000
charge: -0.231249 -0.214225 -0.218496 -0.497792 -0.179787 0.115928 -0.303919 0.287619 -0.232152 0.085746 -0.215042 -0.106542 -0.333319 -0.332960 -0.298322 0.139262 0.304749 -0.180907 -0.199677 0.407964 -0.150599 0.002512 -0.008410 0.298731 -0.153982 0.091586 0.083592 0.063519 0.104209 0.096171 0.098361 0.098954 0.108094 0.097008 0.085811 0.096020 0.099602 0.141343 0.145081 0.176706 0.159896 0.100837 0.114782 0.124944 0.128350
qa: -0.2312 -0.2142 -0.2185 -0.4978 -0.1798 0.1159 -0.3039 0.2876 -0.2322 0.0857 -0.2150 -0.1065 -0.3333 -0.3330 -0.2983 0.1393 0.3047 -0.1809 -0.1997 0.4080 -0.1506 0.0025 -0.0084 0.2987 -0.1540 0.0916 0.0836 0.0635 0.1042 0.0962 0.0984 0.0990 0.1081 0.0970 0.0858 0.0960 0.0996 0.1413 0.1451 0.1767 0.1599 0.1008 0.1148 0.1249 0.1284
va: 1.0530 1.0628 1.0386 2.0171 3.2628 3.3986 2.9441 3.7213 4.0170 3.8540 3.6129 3.8399 3.9026 3.9140 3.9150 3.7007 3.8902 3.9843 3.9720 4.1433 3.6119 3.9538 4.0045 4.2458 3.8677 1.0086 1.0101 1.0115 1.0000 1.0142 1.0004 1.0012 1.0010 1.0101 1.0137 1.0032 1.0004 1.0237 1.0024 1.0108 1.0004 0.9924 1.0077 0.9901 0.9864
dispcorr: -0.022563160 hartree
energy: -1237.167308690486
dipole: 31.11473 -30.27900 0.83573 -27.64180 24.15007 -3.49172 7.86763 -5.24174 2.62589
magnitude: 4.44813 au
magnitude: 11.30626 debye
