program: Orca
programVersion: 4.2.1
elementType: O O O O O O O O O O O N N C C C C C C C C C C C C C C C C C C C C C C C C C C C C C C C H H H H H H H H H H H H H H H H H H H H H H H H H H H H H H H H H H H H H H
charge: 0
multiplicity: 1
keywords: wb97x-d3
keywords: def2-TZVPP
keywords: def2/J RIJCOSX GRIDX6 NOFINALGRIDX
keywords: grid4 nofinalgrid
keywords: scfconv7
keywords: smallprint printgap noloewdin
keywords: NOSOSCF
formula: C31H38N2O11
InChI: InChI=1/C31H38N2O11/c1-17(2)28(35)42-16-41-26-23(39-6)12-13-32-24(26)27(34)33-22-15-40-30(37)21(14-20-10-8-7-9-11-20)25(19(5)43-31(22)38)44-29(36)18(3)4/h7-13,17-19,21-22,25,33H,14-16H2,1-6H3
82 atoms
O  -4.837054 -1.225458 1.719345
O  -1.295502 -0.879951 1.343572
O  -1.697092 -0.236196 -1.231689
O  -2.033554 1.661099 -0.089898
O  -0.19575 -2.649708 0.509316
O  -5.386017 0.158862 3.392031
O  2.738305 1.077034 -0.683894
O  5.392507 1.073613 -1.436791
O  7.440906 -0.415317 -2.146297
O  5.277425 2.313912 0.510942
O  4.893425 0.409982 1.621374
N  1.770833 -0.937932 -0.406161
N  3.908699 -2.231323 -1.130367
C  -3.720859 -0.059565 -0.031222
C  -3.61524 -0.557795 1.426518
C  -2.504529 -1.589877 1.667909
C  -4.859025 0.957388 -0.195052
C  -2.407242 0.572278 -0.4398
C  -2.441795 -2.082315 3.096606
C  -5.013637 1.392543 -1.626854
C  0.476876 -0.411409 -0.086597
C  -0.297763 -0.001816 -1.37297
C  -0.345233 -1.463431 0.627027
C  -5.639339 -0.79348 2.698061
C  -6.871632 -1.653142 2.812883
C  -4.568715 2.639214 -2.057344
C  -5.593207 0.532107 -2.558252
C  -4.701989 3.019749 -3.387045
C  -5.725847 0.907592 -3.886717
C  -6.499167 -3.081727 3.208162
C  -7.684103 -1.625102 1.51907
C  -5.279044 2.154861 -4.305787
C  2.807777 -0.142822 -0.709966
C  4.04599 -0.903596 -1.094835
C  5.237546 -0.276621 -1.419745
C  6.330528 -1.071177 -1.815752
C  4.942097 -2.970492 -1.479681
C  6.175306 -2.448119 -1.835296
C  6.137127 1.659759 -0.400625
C  3.802027 2.437299 2.343291
C  4.686992 1.586961 1.47075
C  2.833381 1.585244 3.14619
C  4.679791 3.296596 3.25998
C  8.575175 -1.170058 -2.550676
H  -3.911683 -0.924836 -0.672476
H  -3.471416 0.294995 2.095969
H  -2.630528 -2.43231 0.98218
H  -4.683988 1.819903 0.450401
H  -5.79289 0.499039 0.13442
H  -3.325883 -2.667707 3.344729
H  -2.362152 -1.255958 3.803578
H  -1.581157 -2.736576 3.231933
H  0.586445 0.458103 0.563764
H  -0.082697 1.032419 -1.63729
H  0.010521 -0.645392 -2.192868
H  -7.470186 -1.214252 3.61271
H  -4.121147 3.323258 -1.347017
H  -5.952214 -0.440537 -2.240496
H  1.893886 -1.935288 -0.52281
H  -4.355414 3.995108 -3.703069
H  -6.182684 0.228416 -4.594678
H  -7.407202 -3.657044 3.387709
H  -5.908841 -3.109581 4.124839
H  -5.937192 -3.586769 2.422532
H  -7.933073 -0.607085 1.215851
H  -8.622939 -2.158734 1.668365
H  -7.156198 -2.108645 0.696846
H  -5.384411 2.450815 -5.341288
H  4.794032 -4.042937 -1.487228
H  6.973333 -3.116974 -2.123807
H  6.777224 0.940345 0.112415
H  6.740666 2.4505 -0.837033
H  3.236802 3.10596 1.688685
H  2.213718 0.956903 2.505677
H  2.164597 2.228956 3.717822
H  3.353343 0.937851 3.852991
H  5.300356 2.674729 3.906843
H  4.048198 3.91335 3.898921
H  5.334184 3.963925 2.700427
H  9.354345 -0.448609 -2.779679
H  8.923719 -1.828391 -1.753449
H  8.365492 -1.760217 -3.444221
elementType: O N C H
totalener: -2141.46714156 hartree
nucrepener: 5554.35789242 hartree
electener: -7695.82503398 hartree
twoeener: 6287.56507629 hartree
cpcmener: -0.07227272 hartree
kineticenergy: 2132.45841333 hartree
xcener: -201.381346989975 hartree
chargesum: -0.0000000
charge: -0.293461 -0.283830 -0.284749 -0.432186 -0.428758 -0.450762 -0.508512 -0.343318 -0.310283 -0.286854 -0.449124 -0.151598 -0.415073 0.097609 0.101109 0.103869 -0.101297 0.293521 -0.291775 0.033143 0.062266 -0.000311 0.415621 0.350985 0.121680 -0.211148 -0.225973 -0.160898 -0.167210 -0.319645 -0.320231 -0.167773 0.273829 0.271029 0.069152 0.300499 -0.038113 -0.167577 0.132489 0.048133 0.404301 -0.284947 -0.285798 -0.128194 0.095318 0.132552 0.113293 0.110498 0.126182 0.101095 0.103570 0.107447 0.112845 0.126802 0.128385 0.050488 0.138274 0.142741 0.175909 0.160530 0.161793 0.107605 0.106948 0.095544 0.107115 0.108505 0.092979 0.163373 0.146879 0.144554 0.122576 0.132944 0.063444 0.091419 0.102019 0.088845 0.097727 0.096791 0.102032 0.127782 0.122269 0.121093
qa: -0.2935 -0.2838 -0.2847 -0.4322 -0.4288 -0.4508 -0.5085 -0.3433 -0.3103 -0.2869 -0.4491 -0.1516 -0.4151 0.0976 0.1011 0.1039 -0.1013 0.2935 -0.2918 0.0331 0.0623 -0.0003 0.4156 0.3510 0.1217 -0.2111 -0.2260 -0.1609 -0.1672 -0.3196 -0.3202 -0.1678 0.2738 0.2710 0.0692 0.3005 -0.0381 -0.1676 0.1325 0.0481 0.4043 -0.2849 -0.2858 -0.1282 0.0953 0.1326 0.1133 0.1105 0.1262 0.1011 0.1036 0.1074 0.1128 0.1268 0.1284 0.0505 0.1383 0.1427 0.1759 0.1605 0.1618 0.1076 0.1069 0.0955 0.1071 0.1085 0.0930 0.1634 0.1469 0.1446 0.1226 0.1329 0.0634 0.0914 0.1020 0.0888 0.0977 0.0968 0.1020 0.1278 0.1223 0.1211
va: 2.0988 2.1492 2.1175 2.0641 2.0653 2.0444 1.9886 2.0161 2.1078 2.1208 2.0440 3.1433 3.0197 3.7114 3.8387 3.8462 3.7435 4.3145 3.9682 3.4781 3.7737 3.8785 4.1713 4.1858 3.7728 3.9318 3.9596 3.9034 3.9130 3.9344 3.9354 3.8886 4.3564 3.5431 4.0537 3.9083 4.0955 3.8596 3.9185 3.8209 4.1387 3.9394 3.9249 3.8559 1.0504 1.0373 1.0207 1.0251 1.0095 1.0080 1.0055 1.0124 1.0360 1.0151 1.0068 1.0336 1.0167 1.0056 1.0660 0.9906 0.9909 1.0044 1.0005 1.0049 1.0014 1.0046 1.0064 0.9885 0.9962 1.0055 1.0008 0.9949 1.0335 1.0053 1.0044 1.0110 1.0015 1.0015 1.0113 0.9926 0.9858 0.9853
dispcorr: -0.049783233 hartree
energy: -2141.516924797679
dipole: -23.41300 24.59404 1.18104 -3.67112 1.14804 -2.52308 17.90926 -18.91287 -1.00361
magnitude: 2.96108 au
magnitude: 7.52647 debye
