program: Gaussian 09
title: 000074336
version: EM64L-G09RevD.01
frameworkgroup: C1[X(C10H6BrClN2O)]
method: RPBEPBE
basis: SDD
operation: Freq
keyword: #p
keyword: freq=noraman
keyword: PBEPBE/SDD
title: #p freq=noraman PBEPBE/SDD
converged: NO YES NO NO
title: Mulliken charges:
elementType: Br Cl O N N C C C C C C C C C C H H H H H H
charge: 0.087860 0.071290 -0.226493 -0.310009 0.044853 0.464909 0.321647 -0.324980 -0.357486 -0.224584 -0.223762 -0.210976 -0.081748 -0.238378 -0.326532 0.292667 0.270871 0.233099 0.232279 0.271288 0.234185
chargesum: 0.00000
title: Mulliken charges with hydrogens summed into heavy atoms:
elementType: Br Cl O N N C C C C C C C C C C
charge: 0.087860 0.071290 -0.226493 -0.310009 0.044853 0.464909 0.321647 -0.032313 -0.086615 -0.224584 0.009336 0.021303 -0.081748 -0.004192 -0.055244
polarizability: 2.78096409e+02 2.04507044e+00 1.54413603e+02 2.86873377e-01 7.22703672e+00 6.06067297e+01
1716.lowfreq: -5.4520 -4.9553 -0.0009 -0.0005 0.0009 0.8785 30.6053 37.8814 78.7518
frequency: 30.5801 37.8704 78.7513 104.5005 149.4177 171.5823 213.5693 245.5116 254.2056 312.0210 340.6812 373.1865 402.2650 445.7740 480.7560 548.7382 571.6281 597.3573 607.7042 614.2781 672.4730 687.6052 722.4813 766.7148 781.6035 836.9205 854.0183 866.1941 922.2401 973.5641 988.4684 995.4171 1010.5602 1037.6707 1058.5789 1101.9165 1134.5382 1175.4090 1193.4558 1201.6767 1247.6469 1324.9244 1346.4895 1387.8282 1443.7171 1476.8787 1481.8691 1542.0729 1594.1565 1603.6840 1606.9719 3135.7821 3148.7588 3166.1206 3181.5024 3186.9353 3211.6225
redmass: 4.4139 8.3096 14.8864 6.7200 15.0786 6.9660 12.0343 10.6892 6.9879 6.9090 11.6642 7.5186 2.9156 8.3765 5.8803 5.0906 9.0860 7.5917 6.2418 6.6230 7.4519 1.9946 8.8789 2.1269 4.8641 1.2758 1.3154 9.0042 1.4113 1.3799 5.4158 1.3593 6.7466 2.2746 4.3863 1.8642 3.9135 1.0498 1.1436 4.7899 5.0897 1.3125 1.6207 9.7393 2.3820 2.2055 8.7073 8.9762 6.6687 8.9941 7.2126 1.0857 1.0910 1.0975 1.0927 1.0955 1.0948
irintensity: 0.3127 0.5688 1.3278 0.7742 0.1920 0.2077 4.8652 0.2868 0.2411 1.4117 0.5366 3.4054 0.3644 6.0577 4.0568 5.8734 4.4727 4.0535 10.4741 1.7359 20.0180 47.2894 0.5508 79.6352 34.5503 0.4713 17.7092 113.0563 5.1386 1.5150 0.6610 1.0091 55.3399 14.0926 42.5021 30.4034 13.0279 0.3346 12.1825 50.7274 14.6993 2.4247 0.9281 5.0820 16.1074 63.0260 30.6095 62.9305 18.0748 140.1800 77.3898 0.1532 17.6337 32.9294 0.2161 3.3640 2.8218
temp: 298.150 k
press: 1.00000 atm
elementType: 35 17 8 7 7 6 6 6 6 6 6 6 6 6 6 1 1 1 1 1 1
symmnumber: 1
zpe: 362760.7 jmol-1
zpe.correction: 0.138168 hartree
zpe.thermalcorrener: 0.150913 hartree
zpe.thermalcorrenthalpy: 0.151857 hartree
zpe.thermalcorrgfe: 0.096334 hartree
zpe.sumelectzpe: -1041.831733 hartree
zpe.sumelectthermal: -1041.818988 hartree
zpe.sumelectthermalent: -1041.818044 hartree
zpe.sumelectthermalfe: -1041.873567 hartree
dipole: 0.9318 -2.9016 0.3453
dipole: 3.0670
quadrupole: -86.6860 -103.2721 -103.8803
quadrupole: 0.3545 0.1958 4.4147
quadrupole: 11.2601 -5.3259 -5.9342 0.3545 0.1958 4.4147
hfenergy: -1041.9699009 hartree
pointgroup: C01 [X(C10H6Br1Cl1N2O1)]
dipole: -0.4531372 -1.1094367 -0.140781 debye
dipolederiv: -0.8533452 0.2863966 0.0197704 0.2424717 -0.0604848 -0.0077425 0.0281131 -0.0049213 0.0334876 -0.2910677 -0.3500089 -0.040917 -0.3633202 -0.4068516 -0.0505635 -0.059677 -0.0480725 0.0077999 -0.4817881 0.2994953 0.0499138 0.2021248 -1.0371089 -0.100632 -0.0050594 -0.086011 -0.3265716 -0.1416863 -0.3269807 -0.0438644 0.779598 -0.4246955 0.0148329 0.0311579 -0.0323016 -0.0555115 0.0971717 -0.0448569 -0.0036473 -0.9960162 -0.0373035 -0.0129532 0.0585503 -0.0114862 -0.10461 0.6063846 0.0299506 0.0002699 -0.1375171 0.018058 -0.0582936 -0.0626322 -0.0211626 0.0627683 0.3916574 -0.443398 -0.0520666 -0.2960656 1.1219791 0.1349274 -0.017407 0.0998495 0.2763655 -0.085066 0.076505 -0.0261896 -0.0616348 -0.0509721 -0.0324891 0.0243784 0.0065854 -0.1093167 -0.04574 -0.0878552 0.0125278 0.0530262 -0.0369369 -0.0316414 -0.0158201 -0.019351 -0.1229377 0.1123671 0.9901358 0.1180345 0.5120788 0.4508275 0.0535796 0.0857912 0.0722977 -0.0480379 -0.061724 -0.1173632 0.0377095 -0.142499 0.0766379 -0.0907601 0.0835615 -0.0715408 -0.1224539 -0.1109156 0.1123276 -0.0416264 0.1981476 0.0530141 -0.0900786 -0.0755024 -0.0817282 -0.1200738 1.3595145 -0.546331 -0.0417766 -0.1192093 0.0565849 0.0131353 -0.0188946 0.006796 -0.0355091 0.0678029 -0.0128906 -0.0061706 -0.0489966 -0.0454115 -0.0308198 0.0240625 -0.0423521 -0.1337882 -0.7440936 0.0979015 0.0047777 0.1372828 0.147793 0.0142479 -0.050904 0.0246437 -0.0512877 0.142891 -0.06332 0.0264237 -0.0483047 0.0728945 0.0495608 0.0423171 0.0144639 0.1485267 0.1160379 0.0665535 -0.0269878 0.0629223 0.038387 0.05849 -0.0625074 0.041195 0.14545 0.0169736 0.0640177 -0.0270707 0.0971448 -0.0333924 0.0780378 -0.0388723 0.0723034 0.1270265 0.0017103 -0.0738988 0.033717 -0.103368 -0.0244825 0.0767187 0.0387991 0.0746966 0.1249172 0.0409075 0.0329753 0.0037825 0.025004 0.0164893 -0.0117889 -0.006039 -0.0138731 0.1492159 -0.1379918 0.0106444 0.0033901 0.0071303 0.1049744 0.0242324 -0.0034157 0.0199691 0.1545405 unknown
polarizability: 277.0468013|-11.5093705|155.5107439|0.2667598|-6.9399931|60.5591963 unknown
InChI: InChI=1S/C10H6BrClN2O/c11-8-6-13-14(10(15)9(8)12)7-4-2-1-3-5-7/h1-6H
charge 0 multiplicity 1
21 atoms
Br 4.659276 -1.203265 -0.074464
Cl 3.456445 1.992787 0.233522
O  0.457919 2.115638 0.205312
N  0.043155 -0.214383 -0.061447
N  0.491938 -1.516153 -0.165065
C  -1.409508 -0.098923 -0.040284
C  0.905716 0.944852 0.080115
C  -2.067401 1.069382 -0.499106
C  -2.160537 -1.20857 0.423054
C  2.344523 0.606839 0.071247
C  -3.478537 1.115237 -0.484928
C  -3.5676 -1.144469 0.433293
C  2.78518 -0.69889 -0.047247
C  -4.23532 0.017449 -0.019524
C  1.805838 -1.743381 -0.158653
H  -1.494972 1.92977 -0.8447
H  -1.638493 -2.107234 0.758897
H  -3.983456 2.01923 -0.841256
H  -4.141599 -2.002396 0.799096
H  2.102657 -2.790537 -0.251608
H  -5.329322 0.065719 -0.007651
