program: Orca
programVersion: 4.2.1
elementType: O O O O O O O O O O O N N C C C C C C C C C C C C C C C C C C C C C C C C C C C C C C C H H H H H H H H H H H H H H H H H H H H H H H H H H H H H H H H H H H H H H
charge: 0
multiplicity: 1
keywords: wb97x-d3
keywords: def2-TZVPP
keywords: def2/J RIJCOSX GRIDX6 NOFINALGRIDX
keywords: grid4 nofinalgrid
keywords: scfconv7
keywords: smallprint printgap noloewdin
keywords: NOSOSCF
formula: C31H38N2O11
InChI: InChI=1/C31H38N2O11/c1-17(2)28(35)42-16-41-26-23(39-6)12-13-32-24(26)27(34)33-22-15-40-30(37)21(14-20-10-8-7-9-11-20)25(19(5)43-31(22)38)44-29(36)18(3)4/h7-13,17-19,21-22,25,33H,14-16H2,1-6H3
82 atoms
O  -4.822687 0.095631 1.383531
O  -1.252628 0.273961 1.330709
O  -1.298563 -0.453302 -1.2489
O  -1.705528 1.74972 -1.2530
O  -0.159807 -1.663411 1.634583
O  -5.494437 2.136842 2.001942
O  3.141818 1.24892 0.79129
O  5.864581 1.006632 0.870177
O  7.893569 -0.702977 1.011579
O  5.579216 1.699179 -1.337065
O  6.543769 -0.113476 -2.236235
N  1.999555 -0.609787 0.19223
N  4.103753 -2.125415 0.357949
C  -3.452646 0.234902 -0.574578
C  -3.549872 0.54293 0.934254
C  -2.524593 -0.198852 1.80465
C  -4.503883 1.006002 -1.394699
C  -2.072021 0.61975 -1.058484
C  -2.663566 0.098483 3.281804
C  -5.89143 0.420774 -1.357919
C  0.707305 -0.008354 0.100688
C  0.114085 -0.282324 -1.307401
C  -0.253777 -0.578808 1.128413
C  -5.694947 0.949615 1.918004
C  -6.944286 0.276033 2.435101
C  -6.118803 -0.899353 -1.745089
C  -6.984693 1.200435 -0.993743
C  -7.400727 -1.427516 -1.755043
C  -8.271273 0.674388 -1.000217
C  -7.057289 0.54597 3.937819
C  -7.048525 -1.209326 2.127729
C  -8.48389 -0.642762 -1.377743
C  3.119756 0.06001 0.517414
C  4.341885 -0.820022 0.521318
C  5.61959 -0.321067 0.713776
C  6.694665 -1.229505 0.781566
C  5.116649 -2.965515 0.39537
C  6.429899 -2.578277 0.615842
C  6.443339 1.680615 -0.219601
C  4.756042 0.986086 -3.429801
C  5.729338 0.770463 -2.299205
C  5.068486 0.072001 -4.603111
C  3.319051 0.788367 -2.938195
C  9.013383 -1.574263 1.080453
H  -3.582461 -0.840909 -0.717766
H  -3.443262 1.620588 1.088199
H  -2.604087 -1.275275 1.628986
H  -4.176092 1.018753 -2.437799
H  -4.52963 2.049659 -1.074684
H  -1.849874 -0.367859 3.836565
H  -3.590615 -0.315039 3.676344
H  -2.647237 1.170428 3.481917
H  0.805367 1.06482 0.263752
H  0.402814 0.503159 -2.005674
H  0.490633 -1.233395 -1.677732
H  -7.772876 0.79301 1.941108
H  -5.287884 -1.524286 -2.051419
H  -6.834464 2.233347 -0.702879
H  2.093863 -1.60502 0.033669
H  -7.554928 -2.454782 -2.059371
H  -9.106062 1.298579 -0.708613
H  -7.989521 0.12626 4.316138
H  -7.057874 1.61185 4.162977
H  -6.238063 0.079828 4.48976
H  -6.986146 -1.415798 1.0601
H  -8.013262 -1.58016 2.475068
H  -6.275403 -1.787351 2.635845
H  -9.484131 -1.055603 -1.381804
H  4.887061 -4.013796 0.250279
H  7.205298 -3.329798 0.654165
H  6.551854 2.712567 0.100263
H  7.416812 1.272306 -0.490742
H  4.863368 2.028004 -3.747099
H  6.082422 0.215127 -4.976327
H  4.384473 0.283935 -5.424855
H  4.948821 -0.979152 -4.338062
H  3.164982 -0.231361 -2.582174
H  2.627236 0.955471 -3.76346
H  3.05566 1.482615 -2.141567
H  9.16091 -2.114156 0.143436
H  9.878092 -0.943211 1.264833
H  8.915206 -2.288903 1.899538
elementType: O N C H
totalener: -2141.46271429 hartree
nucrepener: 5562.50871102 hartree
electener: -7703.97142531 hartree
twoeener: 6294.49133129 hartree
cpcmener: -0.07444262 hartree
kineticenergy: 2132.45767131 hartree
xcener: -201.386917735565 hartree
chargesum: -0.0000000
charge: -0.257859 -0.289441 -0.285455 -0.445151 -0.429622 -0.455207 -0.505060 -0.343939 -0.308751 -0.281505 -0.439172 -0.155927 -0.413465 0.088436 0.091235 0.119160 -0.069036 0.334123 -0.289454 0.002825 0.083728 -0.015889 0.395580 0.331767 0.033295 -0.214765 -0.165284 -0.165384 -0.195661 -0.270715 -0.278384 -0.158447 0.269152 0.267191 0.026378 0.323464 -0.038192 -0.167394 0.119550 0.084580 0.382239 -0.289163 -0.340296 -0.128460 0.084952 0.126241 0.109890 0.125557 0.097944 0.106811 0.093426 0.104726 0.118376 0.135271 0.137018 0.070624 0.137624 0.143042 0.183688 0.157896 0.162012 0.099465 0.099498 0.093824 0.082602 0.102843 0.097565 0.159134 0.148461 0.144307 0.138525 0.131450 0.072200 0.101996 0.098554 0.087090 0.087136 0.119131 0.112094 0.120983 0.128435 0.123988
qa: -0.2579 -0.2894 -0.2855 -0.4452 -0.4296 -0.4552 -0.5051 -0.3439 -0.3088 -0.2815 -0.4392 -0.1559 -0.4135 0.0884 0.0912 0.1192 -0.0690 0.3341 -0.2895 0.0028 0.0837 -0.0159 0.3956 0.3318 0.0333 -0.2148 -0.1653 -0.1654 -0.1957 -0.2707 -0.2784 -0.1584 0.2692 0.2672 0.0264 0.3235 -0.0382 -0.1674 0.1196 0.0846 0.3822 -0.2892 -0.3403 -0.1285 0.0850 0.1262 0.1099 0.1256 0.0979 0.1068 0.0934 0.1047 0.1184 0.1353 0.1370 0.0706 0.1376 0.1430 0.1837 0.1579 0.1620 0.0995 0.0995 0.0938 0.0826 0.1028 0.0976 0.1591 0.1485 0.1443 0.1385 0.1315 0.0722 0.1020 0.0986 0.0871 0.0871 0.1191 0.1121 0.1210 0.1284 0.1240
va: 2.1095 2.1291 2.1294 2.0549 2.0693 2.0446 1.9942 2.0189 2.1110 2.1204 2.0558 3.1472 3.0038 3.7558 3.8076 3.8162 3.7853 4.2588 3.9713 3.5620 3.6934 3.9004 4.2249 4.2133 3.8230 3.9235 3.8363 3.8705 3.8931 3.9271 3.9350 3.8486 4.3289 3.5015 4.0252 3.8811 4.0975 3.8687 3.8986 3.8451 4.1533 3.9441 3.9187 3.8543 1.0576 1.0434 1.0232 1.0018 1.0240 1.0124 1.0135 1.0052 1.0665 1.0104 1.0026 1.0215 1.0061 1.0122 1.0519 0.9927 0.9909 1.0016 1.0160 1.0006 1.0136 1.0040 1.0086 0.9899 0.9959 1.0054 0.9935 1.0076 1.0250 1.0076 1.0044 1.0067 1.0072 1.0006 1.0140 0.9865 0.9929 0.9853
dispcorr: -0.054228046 hartree
energy: -2141.516942334984
dipole: -27.05346 27.82206 0.76860 -5.97022 3.01563 -2.95458 -3.05138 1.94000 -1.11138
magnitude: 3.24892 au
magnitude: 8.25809 debye
