program: Orca
programVersion: 4.2.1
elementType: O O O O O O O O O O O N N C C C C C C C C C C C C C C C C C C C C C C C C C C C C C C C H H H H H H H H H H H H H H H H H H H H H H H H H H H H H H H H H H H H H H
charge: 0
multiplicity: 1
keywords: wb97x-d3
keywords: def2-TZVPP
keywords: def2/J RIJCOSX GRIDX6 NOFINALGRIDX
keywords: grid4 nofinalgrid
keywords: scfconv7
keywords: smallprint printgap noloewdin
keywords: NOSOSCF
formula: C31H38N2O11
InChI: InChI=1/C31H38N2O11/c1-17(2)28(35)42-16-41-26-23(39-6)12-13-32-24(26)27(34)33-22-15-40-30(37)21(14-20-10-8-7-9-11-20)25(19(5)43-31(22)38)44-29(36)18(3)4/h7-13,17-19,21-22,25,33H,14-16H2,1-6H3
82 atoms
O  -4.868597 -1.433789 1.517637
O  -1.324158 -1.024021 1.208235
O  -1.699239 -0.257312 -1.335536
O  -2.06774 1.56663 -0.090684
O  -0.185212 -2.733445 0.30647
O  -5.443604 -0.137676 3.252522
O  2.676501 1.076744 -0.805475
O  5.390011 1.134322 -1.285002
O  7.528521 -0.305627 -1.825004
O  5.14287 2.353332 0.66744
O  4.660398 0.412347 1.660156
N  1.765029 -0.959426 -0.497641
N  3.949996 -2.196317 -1.188199
C  -3.739049 -0.168112 -0.156865
C  -3.64921 -0.73963 1.274945
C  -2.524657 -1.765029 1.484374
C  -4.88623 0.844948 -0.284174
C  -2.425704 0.499036 -0.509794
C  -2.469013 -2.318599 2.891429
C  -4.995132 1.39075 -1.682543
C  0.462094 -0.460077 -0.172323
C  -0.301877 0.00048 -1.447463
C  -0.354745 -1.55776 0.478521
C  -5.68025 -1.056525 2.514253
C  -6.888197 -1.956855 2.597074
C  -4.533641 2.665632 -1.998332
C  -5.54096 0.608857 -2.699537
C  -4.615942 3.148994 -3.297978
C  -5.622919 1.087494 -3.998777
C  -8.024709 -1.282627 3.348696
C  -6.481662 -3.277579 3.259639
C  -5.15864 2.360979 -4.302651
C  2.78485 -0.138095 -0.793785
C  4.060981 -0.869156 -1.108376
C  5.265306 -0.214474 -1.310701
C  6.402757 -0.985236 -1.621201
C  5.018915 -2.913536 -1.464395
C  6.271335 -2.363522 -1.692294
C  6.058896 1.721605 -0.204114
C  3.577114 2.410845 2.44364
C  4.484291 1.59951 1.553609
C  4.410092 2.971728 3.600567
C  2.823805 3.516043 1.714914
C  8.712282 -1.02673 -2.12724
H  -3.911334 -0.999392 -0.846941
H  -3.526085 0.081547 1.987366
H  -2.629033 -2.580272 0.762243
H  -4.744599 1.658088 0.430448
H  -5.823703 0.351108 -0.023021
H  -2.410416 -1.523728 3.636019
H  -1.598764 -2.964547 3.007608
H  -3.344882 -2.929378 3.106033
H  0.553482 0.378301 0.521305
H  -0.09743 1.048911 -1.661006
H  0.026403 -0.601503 -2.292114
H  -7.21174 -2.177518 1.575805
H  -4.110804 3.290857 -1.22156
H  -5.912928 -0.384068 -2.472371
H  1.918059 -1.955877 -0.58657
H  -4.255598 4.144605 -3.52376
H  -6.053925 0.467333 -4.774483
H  -8.897355 -1.936171 3.359438
H  -8.324138 -0.345249 2.878688
H  -7.758001 -1.070893 4.38451
H  -5.721854 -3.81024 2.68752
H  -7.350033 -3.932385 3.33485
H  -6.101624 -3.114702 4.269643
H  -5.223523 2.737032 -5.315599
H  4.888178 -3.987952 -1.513425
H  7.102784 -3.014352 -1.923268
H  6.683634 1.010489 0.340425
H  6.672021 2.528741 -0.597057
H  2.855831 1.702467 2.857616
H  5.163361 3.677829 3.247109
H  4.918127 2.18247 4.155868
H  3.760659 3.500166 4.299578
H  3.49043 4.29842 1.351217
H  2.114993 3.983054 2.399785
H  2.258172 3.128952 0.867941
H  9.496888 -0.285079 -2.252668
H  8.992883 -1.701797 -1.315728
H  8.614089 -1.594219 -3.055221
elementType: O N C H
totalener: -2141.47544624 hartree
nucrepener: 5535.64866386 hartree
electener: -7677.12411010 hartree
twoeener: 6268.64251496 hartree
cpcmener: -0.05739313 hartree
kineticenergy: 2132.46737551 hartree
xcener: -201.378076911599 hartree
chargesum: -0.0000000
charge: -0.300690 -0.279707 -0.280785 -0.407570 -0.410915 -0.424592 -0.477617 -0.326450 -0.302744 -0.276644 -0.439660 -0.161264 -0.410782 0.097221 0.107678 0.103773 -0.082400 0.274087 -0.292818 0.017881 0.089952 -0.000335 0.377652 0.343325 0.062886 -0.203478 -0.218755 -0.160848 -0.165609 -0.282138 -0.306441 -0.161452 0.258391 0.279153 0.062782 0.295879 -0.040595 -0.169769 0.128963 0.051327 0.397361 -0.291547 -0.277898 -0.131302 0.093040 0.129933 0.106849 0.108275 0.117404 0.103907 0.107683 0.099779 0.114642 0.124785 0.125752 0.060887 0.136810 0.140439 0.172521 0.157441 0.157038 0.097352 0.103821 0.085177 0.101976 0.104862 0.104167 0.159460 0.142975 0.138817 0.118911 0.128812 0.053326 0.096619 0.103898 0.096334 0.083636 0.096884 0.097018 0.126424 0.119873 0.118968
qa: -0.3007 -0.2797 -0.2808 -0.4076 -0.4109 -0.4246 -0.4776 -0.3265 -0.3027 -0.2766 -0.4397 -0.1613 -0.4108 0.0972 0.1077 0.1038 -0.0824 0.2741 -0.2928 0.0179 0.0900 -0.0003 0.3777 0.3433 0.0629 -0.2035 -0.2188 -0.1608 -0.1656 -0.2821 -0.3064 -0.1615 0.2584 0.2792 0.0628 0.2959 -0.0406 -0.1698 0.1290 0.0513 0.3974 -0.2915 -0.2779 -0.1313 0.0930 0.1299 0.1068 0.1083 0.1174 0.1039 0.1077 0.0998 0.1146 0.1248 0.1258 0.0609 0.1368 0.1404 0.1725 0.1574 0.1570 0.0974 0.1038 0.0852 0.1020 0.1049 0.1042 0.1595 0.1430 0.1388 0.1189 0.1288 0.0533 0.0966 0.1039 0.0963 0.0836 0.0969 0.0970 0.1264 0.1199 0.1190
va: 2.1170 2.1529 2.1187 2.0962 2.0858 2.0795 2.0310 2.0395 2.1125 2.1231 2.0597 3.1471 3.0222 3.7093 3.8321 3.8622 3.7371 4.3379 3.9675 3.5106 3.7952 3.8450 4.2020 4.2079 3.8313 3.9271 3.9596 3.9138 3.9131 3.9408 3.9112 3.8943 4.3754 3.5173 4.0734 3.9045 4.1035 3.8578 3.9310 3.8263 4.1381 3.9403 3.9246 3.8638 1.0497 1.0376 1.0221 1.0198 1.0134 1.0060 1.0123 1.0084 1.0359 1.0174 1.0066 1.0291 1.0175 1.0064 1.0696 0.9917 0.9922 1.0038 1.0048 1.0106 1.0057 1.0036 0.9998 0.9897 0.9971 1.0070 1.0014 0.9945 1.0296 1.0046 1.0061 1.0027 1.0123 1.0031 1.0196 0.9934 0.9855 0.9850
dispcorr: -0.048777248 hartree
energy: -2141.524223491469
dipole: -23.76723 25.08889 1.32166 0.09776 -2.32246 -2.22470 20.38645 -21.00266 -0.61621
magnitude: 2.66004 au
magnitude: 6.76128 debye
