program: Orca
programVersion: 4.2.1
elementType: O O O O O O O O O O O N N C C C C C C C C C C C C C C C C C C C C C C C C C C C C C C C H H H H H H H H H H H H H H H H H H H H H H H H H H H H H H H H H H H H H H
charge: 0
multiplicity: 1
keywords: wb97x-d3
keywords: def2-TZVPP
keywords: def2/J RIJCOSX GRIDX6 NOFINALGRIDX
keywords: grid4 nofinalgrid
keywords: scfconv7
keywords: smallprint printgap noloewdin
keywords: NOSOSCF
formula: C31H38N2O11
InChI: InChI=1/C31H38N2O11/c1-17(2)28(35)42-16-41-26-23(39-6)12-13-32-24(26)27(34)33-22-15-40-30(37)21(14-20-10-8-7-9-11-20)25(19(5)43-31(22)38)44-29(36)18(3)4/h7-13,17-19,21-22,25,33H,14-16H2,1-6H3
82 atoms
O  -4.634973 -0.005004 2.427639
O  -1.182101 0.091112 1.489449
O  -1.842417 -0.852973 -0.941879
O  -2.256759 1.347241 -1.003864
O  -0.060406 -1.842342 1.694274
O  -5.309037 2.105758 2.76707
O  2.96901 0.665364 0.498393
O  5.679316 0.138311 0.678787
O  7.565512 -1.661696 0.324092
O  5.516775 2.068294 -0.578636
O  4.698341 0.796144 -2.224557
N  1.685046 -1.00174 -0.327369
N  3.684213 -2.634823 -0.544623
C  -3.761306 -0.098629 0.201125
C  -3.505303 0.376223 1.647104
C  -2.292946 -0.287884 2.317066
C  -5.01464 0.548398 -0.406722
C  -2.553047 0.239632 -0.646485
C  -2.06036 0.184542 3.7353
C  -5.241847 0.079509 -1.818781
C  0.425648 -0.351737 -0.148521
C  -0.490135 -0.698852 -1.351659
C  -0.269441 -0.806699 1.128884
C  -5.457439 0.923338 2.931067
C  -6.571643 0.304946 3.738919
C  -5.716612 -1.208849 -2.060222
C  -4.951759 0.897501 -2.907036
C  -5.894597 -1.669716 -3.355972
C  -5.131818 0.440184 -4.206255
C  -7.909376 0.927734 3.3561
C  -6.270729 0.503418 5.225794
C  -5.600893 -0.845253 -4.434787
C  2.858281 -0.465707 0.060969
C  4.014224 -1.416444 -0.111495
C  5.324243 -1.068581 0.17724
C  6.329477 -2.042281 0.01206
C  4.627803 -3.536671 -0.712111
C  5.968136 -3.298447 -0.44878
C  6.372123 1.028615 -0.150902
C  3.833746 3.028348 -1.918641
C  4.696597 1.831602 -1.611138
C  4.694846 4.124344 -2.554235
C  2.668255 2.647636 -2.816529
C  8.622856 -2.595195 0.170526
H  -3.891036 -1.184624 0.216053
H  -3.376941 1.462583 1.660492
H  -2.411874 -1.375263 2.297778
H  -4.928887 1.636046 -0.374195
H  -5.880582 0.277103 0.19941
H  -2.868185 -0.140724 4.389551
H  -1.986328 1.271457 3.790765
H  -1.13981 -0.244769 4.130549
H  0.581965 0.726587 -0.096553
H  -0.382567 0.039879 -2.145479
H  -0.210276 -1.671973 -1.750461
H  -6.601395 -0.766124 3.530272
H  -5.954631 -1.858082 -1.224857
H  -4.584809 1.902737 -2.739537
H  1.705922 -1.977633 -0.594735
H  -6.266404 -2.672423 -3.524253
H  -4.904503 1.091218 -5.040826
H  -8.712776 0.453854 3.91996
H  -8.132775 0.794673 2.296819
H  -7.933979 1.995034 3.575061
H  -5.324787 0.045482 5.518055
H  -7.054351 0.040956 5.825716
H  -6.230241 1.561644 5.485685
H  -5.740745 -1.202235 -5.447019
H  4.315996 -4.509699 -1.072156
H  6.687772 -4.090892 -0.598064
H  7.130495 1.518628 0.454441
H  6.839789 0.53351 -1.004086
H  3.447084 3.405593 -0.967608
H  5.139193 3.783857 -3.491213
H  5.499116 4.453091 -1.896543
H  4.077978 4.9948 -2.778221
H  2.048714 1.869636 -2.370301
H  3.004266 2.291957 -3.790559
H  2.030662 3.515482 -2.983822
H  8.485389 -3.469535 0.810294
H  8.731303 -2.916564 -0.8677
H  9.530382 -2.07952 0.473526
elementType: O N C H
totalener: -2141.47631426 hartree
nucrepener: 5527.34172849 hartree
electener: -7668.81804275 hartree
twoeener: 6260.41778969 hartree
cpcmener: -0.06057825 hartree
kineticenergy: 2132.47516377 hartree
xcener: -201.378777277521 hartree
chargesum: -0.0000000
charge: -0.301849 -0.282006 -0.274706 -0.405568 -0.407131 -0.432823 -0.473114 -0.324665 -0.302294 -0.281337 -0.432628 -0.161602 -0.406760 0.087932 0.132030 0.106063 -0.071166 0.276140 -0.294739 0.012344 0.079188 0.003352 0.366604 0.334053 0.059054 -0.213114 -0.200263 -0.170031 -0.163060 -0.277013 -0.281701 -0.159246 0.266086 0.267470 0.053154 0.304168 -0.039134 -0.173287 0.129874 0.045297 0.389428 -0.284246 -0.273811 -0.132008 0.093284 0.129902 0.105914 0.109071 0.112242 0.095504 0.104233 0.107428 0.116945 0.121300 0.125376 0.055366 0.139454 0.136197 0.174494 0.157994 0.156727 0.096752 0.100172 0.088845 0.099567 0.098116 0.096933 0.159960 0.143694 0.139534 0.129086 0.118958 0.064016 0.095653 0.102046 0.095681 0.084332 0.086823 0.099511 0.120246 0.119516 0.126194
qa: -0.3018 -0.2820 -0.2747 -0.4056 -0.4071 -0.4328 -0.4731 -0.3247 -0.3023 -0.2813 -0.4326 -0.1616 -0.4068 0.0879 0.1320 0.1061 -0.0712 0.2761 -0.2947 0.0123 0.0792 0.0034 0.3666 0.3341 0.0591 -0.2131 -0.2003 -0.1700 -0.1631 -0.2770 -0.2817 -0.1592 0.2661 0.2675 0.0532 0.3042 -0.0391 -0.1733 0.1299 0.0453 0.3894 -0.2842 -0.2738 -0.1320 0.0933 0.1299 0.1059 0.1091 0.1122 0.0955 0.1042 0.1074 0.1169 0.1213 0.1254 0.0554 0.1395 0.1362 0.1745 0.1580 0.1567 0.0968 0.1002 0.0888 0.0996 0.0981 0.0969 0.1600 0.1437 0.1395 0.1291 0.1190 0.0640 0.0957 0.1020 0.0957 0.0843 0.0868 0.0995 0.1202 0.1195 0.1262
va: 2.1128 2.1297 2.1128 2.0986 2.0983 2.0730 2.0335 2.0410 2.1132 2.1251 2.0630 3.1483 3.0232 3.7140 3.7919 3.8559 3.7438 4.3309 3.9709 3.5294 3.7084 3.9299 4.2605 4.1914 3.8464 3.9586 3.9261 3.9185 3.9157 3.9354 3.9368 3.8912 4.3794 3.5308 4.0863 3.8991 4.0994 3.8648 3.9308 3.8249 4.1621 3.9238 3.9427 3.8632 1.0491 1.0379 1.0236 1.0212 1.0168 1.0137 1.0042 1.0112 1.0518 1.0098 1.0033 1.0369 1.0065 1.0167 1.0571 0.9921 0.9920 1.0029 1.0039 1.0144 1.0042 1.0021 1.0083 0.9894 0.9972 1.0072 0.9939 1.0007 1.0331 1.0017 1.0116 1.0018 1.0102 1.0112 1.0048 0.9847 0.9854 0.9936
dispcorr: -0.048765768 hartree
energy: -2141.525080029997
dipole: -24.01463 25.25630 1.24167 10.30639 -12.91988 -2.61348 4.22572 -4.50186 -0.27614
magnitude: 2.90660 au
magnitude: 7.38798 debye
