program: Orca
programVersion: 4.2.1
elementType: O O O O O O O O O O O N N C C C C C C C C C C C C C C C C C C C C C C C C C C C C C C C H H H H H H H H H H H H H H H H H H H H H H H H H H H H H H H H H H H H H H
charge: 0
multiplicity: 1
keywords: wb97x-d3
keywords: def2-TZVPP
keywords: def2/J RIJCOSX GRIDX6 NOFINALGRIDX
keywords: grid4 nofinalgrid
keywords: scfconv7
keywords: smallprint printgap noloewdin
keywords: NOSOSCF
formula: C31H38N2O11
InChI: InChI=1/C31H38N2O11/c1-17(2)28(35)42-16-41-26-23(39-6)12-13-32-24(26)27(34)33-22-15-40-30(37)21(14-20-10-8-7-9-11-20)25(19(5)43-31(22)38)44-29(36)18(3)4/h7-13,17-19,21-22,25,33H,14-16H2,1-6H3
82 atoms
O  -4.802512 -1.1065 1.854972
O  -1.266078 -0.833292 1.370334
O  -1.718256 -0.459177 -1.247264
O  -2.043626 1.557791 -0.323713
O  -0.161832 -2.672007 0.704662
O  -5.173433 0.384864 3.491534
O  2.696939 0.959994 -0.897883
O  5.429424 0.960315 -1.337822
O  7.575485 -0.53601 -1.675435
O  5.183149 2.425728 0.43318
O  4.612175 0.622611 1.62426
N  1.771474 -1.039355 -0.423969
N  3.966548 -2.332583 -0.940528
C  -3.722811 -0.144317 -0.042931
C  -3.579868 -0.49898 1.452551
C  -2.464823 -1.511033 1.757763
C  -4.860896 0.858517 -0.277771
C  -2.415557 0.441418 -0.545642
C  -2.386391 -1.908157 3.218068
C  -5.080134 1.116529 -1.743778
C  0.478319 -0.501063 -0.133395
C  -0.327736 -0.231914 -1.437203
C  -0.317733 -1.485453 0.699257
C  -5.5127 -0.579305 2.868205
C  -6.777592 -1.372709 3.106303
C  -4.562277 2.247015 -2.367157
C  -5.786983 0.196521 -2.514177
C  -4.746918 2.452146 -3.727143
C  -5.971809 0.396904 -3.872634
C  -6.449834 -2.788801 3.580472
C  -7.667704 -1.394826 1.864508
C  -5.450098 1.52805 -4.484123
C  2.802913 -0.2430 -0.768844
C  4.084437 -1.005567 -0.984804
C  5.298438 -0.377395 -1.224664
C  6.432206 -1.184995 -1.433708
C  5.030355 -3.080565 -1.126056
C  6.292042 -2.562502 -1.379763
C  6.087945 1.663681 -0.32717
C  3.511906 2.711466 2.087195
C  4.460113 1.784829 1.365319
C  4.274475 3.418749 3.212041
C  2.813764 3.712368 1.173682
C  8.738569 -1.289651 -1.924601
H  -3.934648 -1.064477 -0.59659
H  -3.40183 0.415491 2.026746
H  -2.596664 -2.404125 1.138162
H  -4.641472 1.789063 0.248588
H  -5.78145 0.459261 0.151055
H  -3.270207 -2.469347 3.517327
H  -2.295495 -1.035917 3.865673
H  -1.524277 -2.553748 3.380144
H  0.586948 0.436201 0.41643
H  -0.120784 0.773349 -1.80316
H  -0.021537 -0.956708 -2.18893
H  -7.303615 -0.849208 3.906999
H  -4.006752 2.970576 -1.784251
H  -6.203045 -0.686564 -2.041459
H  1.930474 -2.03671 -0.374875
H  -4.338495 3.338114 -4.195451
H  -6.526325 -0.328073 -4.454186
H  -7.369032 -3.315478 3.837276
H  -5.818769 -2.782033 4.469975
H  -5.943287 -3.364432 2.806015
H  -7.903792 -0.38878 1.515642
H  -8.611936 -1.888536 2.095025
H  -7.201042 -1.939963 1.044366
H  -5.593774 1.68856 -5.544503
H  4.886276 -4.153474 -1.074437
H  7.124392 -3.23478 -1.532435
H  6.675359 1.004439 0.317172
H  6.73502 2.39537 -0.805674
H  2.762888 2.059726 2.542726
H  3.587774 4.031199 3.796795
H  5.04703 4.077505 2.813509
H  4.74612 2.708507 3.891437
H  3.515085 4.432695 0.754078
H  2.069717 4.268485 1.745271
H  2.304368 3.217088 0.349632
H  9.534577 -0.573816 -2.112733
H  9.018178 -1.908714 -1.067335
H  8.628642 -1.930117 -2.804131
totalener: -2141.43440786 hartree
nucrepener: 5554.72199779 hartree
electener: -7696.15640565 hartree
twoeener: 6285.64157791 hartree
kineticenergy: 2132.54787475 hartree
xcener: -201.379605561905 hartree
chargesum: 0.0000000
charge: -0.296915 -0.274326 -0.272641 -0.337300 -0.346807 -0.329421 -0.419161 -0.284969 -0.281171 -0.261254 -0.368347 -0.171213 -0.373400 0.094133 0.091531 0.096800 -0.122663 0.246989 -0.289330 0.054356 0.070309 -0.012913 0.335416 0.286080 0.092205 -0.183436 -0.208495 -0.121195 -0.126353 -0.313977 -0.309902 -0.129424 0.264264 0.269940 0.079642 0.268678 -0.041334 -0.156960 0.116782 0.022371 0.364303 -0.293022 -0.250672 -0.148210 0.078007 0.133520 0.092121 0.117591 0.099542 0.081134 0.105299 0.111149 0.112686 0.130833 0.106448 0.060049 0.127036 0.111940 0.171384 0.125995 0.122805 0.097672 0.101204 0.094248 0.101920 0.098816 0.089550 0.124602 0.113427 0.109285 0.106036 0.106549 0.053363 0.087006 0.091326 0.103883 0.077095 0.081778 0.109680 0.120506 0.107395 0.108134
qa: -0.2969 -0.2743 -0.2726 -0.3373 -0.3468 -0.3294 -0.4192 -0.2850 -0.2812 -0.2613 -0.3683 -0.1712 -0.3734 0.0941 0.0915 0.0968 -0.1227 0.2470 -0.2893 0.0544 0.0703 -0.0129 0.3354 0.2861 0.0922 -0.1834 -0.2085 -0.1212 -0.1264 -0.3140 -0.3099 -0.1294 0.2643 0.2699 0.0796 0.2687 -0.0413 -0.1570 0.1168 0.0224 0.3643 -0.2930 -0.2507 -0.1482 0.0780 0.1335 0.0921 0.1176 0.0995 0.0811 0.1053 0.1111 0.1127 0.1308 0.1064 0.0600 0.1270 0.1119 0.1714 0.1260 0.1228 0.0977 0.1012 0.0942 0.1019 0.0988 0.0896 0.1246 0.1134 0.1093 0.1060 0.1065 0.0534 0.0870 0.0913 0.1039 0.0771 0.0818 0.1097 0.1205 0.1074 0.1081
va: 2.0690 2.1421 2.1253 2.1625 2.1452 2.1676 2.0808 2.0873 2.1204 2.1314 2.1274 3.1358 3.0416 3.7162 3.8424 3.8937 3.7908 4.3614 3.9602 3.5454 3.8203 3.8738 4.2226 4.2383 3.7724 3.9914 4.0119 3.9618 3.9825 3.9369 3.9395 3.9606 4.3460 3.5563 4.0969 3.9058 4.1466 3.8496 3.9825 3.8556 4.1637 3.9387 3.9224 3.8988 1.0509 1.0375 1.0244 1.0227 1.0156 1.0122 1.0079 1.0142 1.0360 1.0128 1.0099 1.0323 1.0195 1.0104 1.0684 1.0004 1.0016 1.0080 1.0024 1.0052 1.0033 1.0078 1.0073 0.9998 1.0033 1.0143 0.9992 0.9949 1.0291 1.0051 1.0059 1.0064 1.0147 1.0033 1.0225 0.9975 0.9844 0.9854
dispcorr: -0.049581643 hartree
energy: -2141.483989501422
dipole: -23.89986 24.87543 0.97557 1.45611 -2.94931 -1.49319 16.23932 -16.59191 -0.35258
magnitude: 1.81815 au
magnitude: 4.62138 debye
