program: Gaussian 09
title: 000074384
version: EM64L-G09RevD.01
frameworkgroup: C1[X(C11H18NO5PS2)]
method: RPBEPBE
basis: SDD
operation: Freq
keyword: #p
keyword: freq=noraman
keyword: PBEPBE/SDD
title: #p freq=noraman PBEPBE/SDD
converged: NO YES NO NO
title: Mulliken charges:
elementType: S S P O O O O O N C C C C C C C C C C C H H H H H H H H H H H H H H H H H H
charge: 0.929258 -0.208262 0.873073 -0.538172 -0.539807 -0.496562 -0.457601 -0.468936 -0.505713 -0.073469 -0.029464 -0.654612 -0.667701 -0.217033 -0.215814 0.376027 -0.295507 -0.340202 -0.476373 -0.475125 0.246037 0.305632 0.213432 0.206319 0.243242 0.261629 0.215571 0.199527 0.280400 0.286845 0.283804 0.264599 0.248813 0.242202 0.244131 0.249866 0.240985 0.248962
chargesum: 0.00000
title: Mulliken charges with hydrogens summed into heavy atoms:
elementType: S S P O O O O O N C C C C C C C C C C C
charge: 0.929258 -0.208262 0.873073 -0.538172 -0.539807 -0.496562 -0.457601 -0.468936 -0.200081 0.172568 -0.029464 0.008381 0.009026 0.063367 0.071030 0.376027 -0.011703 -0.075603 0.258773 0.264687
polarizability: 2.90870844e+02 2.98200729e+00 1.85617955e+02 -2.98024948e+00 5.83389693e+00 1.85109538e+02
1716.lowfreq: -9.5961 -2.9761 -0.0028 -0.0023 -0.0020 0.9121 5.4742 11.2274 26.8904
frequency: -4.4878 9.0911 26.8171 34.9815 40.3694 48.1966 52.5488 74.2375 86.1892 109.7559 112.2964 126.2376 138.4700 143.7994 154.2382 176.2795 193.8249 211.3612 226.0533 230.3821 235.4818 252.1827 261.7622 281.7557 305.6935 323.9525 356.8925 373.8001 378.8815 396.7735 414.2166 425.4409 430.9345 475.7979 480.7186 500.7641 524.0955 575.6103 617.1735 686.5676 688.6673 696.1567 716.7002 794.4507 798.6872 829.3089 833.5450 846.6810 851.4873 916.6410 931.7878 935.4492 940.7217 955.3225 963.3782 970.1726 977.4263 993.2929 1051.2125 1107.1086 1113.0689 1113.3890 1124.4072 1131.0441 1132.5081 1137.0016 1161.6692 1165.5780 1191.9361 1273.9235 1286.1995 1288.4164 1373.8335 1376.9584 1385.0316 1396.4016 1400.6047 1422.0668 1424.0191 1457.7705 1458.5902 1459.4529 1461.6028 1463.5324 1468.4596 1470.1418 1477.5894 1486.3547 1585.8496 1599.1513 2974.3802 2984.1131 2986.8958 2988.7712 3019.8745 3068.5551 3081.2760 3093.1461 3094.5226 3096.1159 3104.3333 3135.5403 3138.5422 3156.5473 3158.7535 3173.1309 3181.8299 3329.6234
redmass: 4.3518 4.0786 5.2005 4.4326 3.3548 3.5535 3.7727 3.8248 5.2035 1.6127 2.4610 1.2171 3.2558 5.0624 4.0823 6.3099 6.8656 1.0671 6.6565 7.2443 1.8797 6.3383 2.2806 3.2050 7.3938 5.4503 5.8605 5.9160 2.9767 7.4075 2.9658 5.8214 2.9772 6.2752 6.7968 3.2672 3.7593 7.5724 7.3179 10.0892 9.4479 12.0721 3.9343 13.4835 2.8908 3.8362 1.4744 1.6522 1.5571 1.2837 2.3188 4.1763 1.4988 11.3197 1.3469 11.0689 1.3611 5.1371 2.4273 1.2926 1.2425 1.2433 1.7823 1.3012 1.3002 2.1402 1.7949 1.4775 2.4584 1.2893 1.2655 1.4368 1.1742 1.2139 7.0318 1.2066 3.6406 1.1230 1.1197 1.0534 1.0562 1.0502 1.0493 2.1852 1.0559 1.0553 1.0521 1.0456 6.1576 8.0925 1.0371 1.0360 1.0302 1.0303 1.0843 1.0991 1.0988 1.1048 1.1000 1.1046 1.1001 1.1035 1.1038 1.0889 1.0895 1.0974 1.0968 1.0740
irintensity: 1.5792 0.2202 0.2475 0.2313 3.6923 0.9306 1.7390 6.0234 0.9151 1.3258 4.2699 1.0674 1.9693 3.5287 1.8180 4.1016 0.8928 0.0735 13.6926 9.7293 1.7855 23.2308 3.5294 13.7246 3.5785 1.6325 5.8756 24.5936 2.5327 7.5969 0.2563 18.9786 5.8062 144.5482 9.0347 10.1825 84.9601 76.0590 2.7582 127.7082 78.8271 150.6004 9.5770 76.2009 100.5180 200.7182 44.6385 67.0824 60.7875 6.8443 8.4632 37.4079 2.0512 225.8954 0.4633 169.3504 0.0433 3.6423 32.4332 14.8048 0.0897 0.8124 17.2242 1.1584 0.7654 51.4868 90.9221 82.7006 177.4809 3.6160 3.7966 6.1932 10.1534 28.1927 2.5199 12.7016 11.9170 2.7067 6.3146 6.4488 17.9602 5.2922 4.8894 137.5332 15.2538 18.7342 2.8036 22.4437 76.7210 5.6845 23.5118 34.8313 45.6964 41.2783 3.9297 7.7647 55.2579 21.1107 12.3600 21.0538 28.7551 12.8497 9.6391 0.2832 1.2271 1.0070 4.7862 13.3773
temp: 298.150 k
press: 1.00000 atm
elementType: 16 16 15 8 8 8 8 8 7 6 6 6 6 6 6 6 6 6 6 6 1 1 1 1 1 1 1 1 1 1 1 1 1 1 1 1 1 1
symmnumber: 1
zpe: 743744.2 jmol-1
zpe.correction: 0.283277 hartree
zpe.thermalcorrener: 0.307483 hartree
zpe.thermalcorrenthalpy: 0.308427 hartree
zpe.thermalcorrgfe: 0.226001 hartree
zpe.sumelectzpe: -1996.437577 hartree
zpe.sumelectthermal: -1996.413371 hartree
zpe.sumelectthermalent: -1996.412427 hartree
zpe.sumelectthermalfe: -1996.494854 hartree
dipole: -4.2347 3.7975 -0.9492
dipole: 5.7667
quadrupole: -123.3673 -150.9445 -134.5117
quadrupole: 17.2145 -5.5135 11.7504
quadrupole: 12.9072 -14.6700 1.7628 17.2145 -5.5135 11.7504
hfenergy: -1996.7208543 hartree
pointgroup: C01 [X(C11H18N1O5P1S2)]
dipole: 1.7588159 -1.292015 -0.6201961 debye
polarizability: 290.0095981|8.2969104|188.4821274|6.5264213|-4.8505236|183.1066116 unknown
InChI: InChI=1S/C11H18NO5PS2/c1-9(2)12-20(13,14)11-7-5-10(6-8-11)17-18(19,15-3)16-4/h5-9,12H,1-4H3
charge 0 multiplicity 1
38 atoms
S  -3.16983 0.653582 0.165367
S  3.795217 -1.526748 -1.509442
P  4.028229 -0.071163 -0.075136
O  -3.877062 0.238932 1.579764
O  -3.441168 2.080713 -0.578294
O  2.781413 0.114884 1.134437
O  5.387818 -0.178331 0.971132
O  4.162046 1.567843 -0.583229
N  -3.534265 -0.665703 -1.126581
C  -4.428183 -1.773349 -0.651282
C  -1.315885 0.475179 0.426241
C  -4.225132 -2.942475 -1.642292
C  -5.912045 -1.362058 -0.517567
C  -0.452291 1.144069 -0.456079
C  -0.871982 -0.293641 1.514504
C  1.405025 0.234474 0.828358
C  0.93741 1.026636 -0.246849
C  0.518238 -0.420561 1.711985
C  5.782497 -1.505271 1.502791
C  5.174009 1.895342 -1.620443
H  -4.049125 -2.073114 0.343853
H  -3.970845 -0.112403 -1.893652
H  -4.798002 -3.824137 -1.30146
H  -4.584633 -2.6724 -2.652781
H  -3.158409 -3.212061 -1.713624
H  -6.026016 -0.548732 0.219564
H  -6.52153 -2.2199 -0.179168
H  -6.314361 -1.024891 -1.492742
H  -0.853423 1.76387 -1.263817
H  -1.592672 -0.759989 2.193353
H  1.647563 1.556884 -0.888575
H  0.924155 -1.008626 2.539454
H  6.794431 -1.351927 1.904678
H  5.79646 -2.263231 0.698188
H  5.090904 -1.808868 2.307083
H  4.951724 2.934275 -1.903236
H  5.069319 1.226556 -2.494482
H  6.1880 1.820137 -1.192919
