program: Orca
programVersion: 5.0.2
elementType: S O N N N C C C C C C C C C C C C C C C C C H H H H H H H H H H H H H H H H H
charge: 0
multiplicity: 1
keywords: wb97x-d3
keywords: def2-TZVPP
keywords: def2/J RIJCOSX
keywords: DEFGRID2
keywords: scfconv7
keywords: smallprint printgap noloewdin
keywords: NOSOSCF
formula: C17H17N3OS
InChI: InChI=1/C17H17N3OS/c1-17(13-9-5-3-6-10-13)15(21)20(16(18-17)22-2)19-14-11-7-4-8-12-14/h3-12,19H,1-2H3
39 atoms
S  -1.019735 -2.205946 -1.257842
O  0.352759 2.176811 0.590743
N  -0.468572 0.255364 -0.361311
N  1.002274 -1.304267 0.298802
N  -1.568996 0.761736 -0.959235
C  1.43911 -0.036159 0.874445
C  0.420325 0.993147 0.382598
C  2.836924 0.336631 0.409551
C  1.358503 -0.126778 2.400528
C  -0.054629 -1.07742 -0.361451
C  3.430261 1.517155 0.857841
C  3.55178 -0.486771 -0.454012
C  -2.8226 0.596838 -0.37925
C  4.70816 1.863756 0.446235
C  4.833754 -0.139754 -0.86124
C  5.416881 1.035876 -0.414652
C  -3.953792 0.875513 -1.147624
C  -2.976366 0.197686 0.947188
C  -0.029794 -3.697189 -1.03366
C  -5.216628 0.759142 -0.591992
C  -4.249513 0.081719 1.487223
C  -5.377207 0.360588 0.729313
H  2.031905 -0.90567 2.756761
H  0.345868 -0.375124 2.721904
H  1.641526 0.814709 2.86875
H  2.901221 2.178811 1.531275
H  3.11247 -1.407904 -0.810734
H  -1.508649 0.868273 -1.962052
H  5.151507 2.785463 0.800979
H  5.376442 -0.795932 -1.529955
H  6.416346 1.304893 -0.731628
H  -3.841519 1.184319 -2.180565
H  -2.117212 -0.020177 1.568787
H  0.037735 -3.972079 0.016025
H  0.965444 -3.575304 -1.454361
H  -0.548707 -4.486551 -1.574253
H  -6.083272 0.980503 -1.201943
H  -4.353087 -0.230736 2.518648
H  -6.365508 0.266995 1.159267
elementType: S O N C H
totalener: -1295.80629827 hartree
nucrepener: 1897.31081813 hartree
electener: -3193.11711640 hartree
oneelecener: -5538.80526329 hartree
twoeener: 2345.68814689 hartree
cpcmener: -0.03152956 hartree
kineticenergy: 1291.20650282 hartree
xcener: -107.258786402341 hartree
chargesum: -0.0000000
charge: -0.028132 -0.433186 0.060529 -0.437783 -0.203714 0.411294 0.230956 0.036034 -0.305453 0.161052 -0.214494 -0.206944 0.148187 -0.175097 -0.158816 -0.155989 -0.216222 -0.196153 -0.241114 -0.128427 -0.154441 -0.199569 0.112938 0.111282 0.107606 0.137914 0.148262 0.187219 0.155827 0.154758 0.156959 0.138896 0.147968 0.121503 0.123547 0.135372 0.156086 0.154790 0.156554
qa: -0.0281 -0.4332 0.0605 -0.4378 -0.2037 0.4113 0.2310 0.0360 -0.3055 0.1611 -0.2145 -0.2069 0.1482 -0.1751 -0.1588 -0.1560 -0.2162 -0.1962 -0.2411 -0.1284 -0.1544 -0.1996 0.1129 0.1113 0.1076 0.1379 0.1483 0.1872 0.1558 0.1548 0.1570 0.1389 0.1480 0.1215 0.1235 0.1354 0.1561 0.1548 0.1566
va: 2.4205 2.0926 3.1004 2.9921 3.0495 3.7307 4.2578 3.5391 3.9671 4.2453 3.9827 3.9628 3.8226 3.9385 3.9219 3.9037 3.9543 3.8966 3.9615 3.9104 3.9250 3.8957 1.0074 1.0036 1.0060 1.0253 1.0183 1.0062 0.9930 0.9938 0.9905 1.0091 1.0072 1.0084 1.0036 1.0003 0.9900 0.9923 0.9910
dispcorr: -0.019543612 hartree
energy: -1295.825841881427
dipole: 2.92144 -3.07878 -0.15734 -4.51421 2.85859 -1.65562 4.31605 -5.16267 -0.84662
magnitude: 1.86617 au
magnitude: 4.74343 debye
