program: Gaussian 09
title: 000074324
version: EM64L-G09RevD.01
frameworkgroup: C1[X(C14H7F3OS)]
method: RPBEPBE
basis: SDD
operation: Freq
keyword: #p
keyword: freq=noraman
keyword: PBEPBE/SDD
title: #p freq=noraman PBEPBE/SDD
converged: YES YES NO NO
title: Mulliken charges:
elementType: S F F F O C C C C C C C C C C C C C C H H H H H H H
charge: 0.232854 -0.165201 -0.160942 -0.160897 -0.241633 0.412092 -0.329865 0.387956 0.064543 -0.308632 -0.424767 0.297037 -0.264284 -0.372391 -0.330970 -0.289901 0.249287 -0.241738 -0.216825 0.311903 0.256185 0.274527 0.289074 0.249414 0.242286 0.240888
chargesum: 0.00000
title: Mulliken charges with hydrogens summed into heavy atoms:
elementType: S F F F O C C C C C C C C C C C C C C
charge: 0.232854 -0.165201 -0.160942 -0.160897 -0.241633 0.412092 -0.329865 0.387956 0.064543 -0.308632 -0.112865 0.297037 -0.008099 -0.097864 -0.041896 -0.040487 0.249287 0.000548 0.024064
polarizability: 2.82696570e+02 1.14602858e+01 1.82665223e+02 -3.03680501e-02 -1.13351019e-03 6.98535864e+01
1716.lowfreq: -15.7073 -0.8864 -0.0023 -0.0021 0.0005 0.5992 5.8392 33.4154 75.2231
frequency: -15.4859 33.3342 75.2084 106.3215 119.7261 136.5771 204.5557 210.3303 230.7672 244.3362 305.8581 355.9391 356.7623 379.1212 404.6097 414.5645 441.6931 447.2865 465.3992 488.6526 492.7995 514.2422 588.5401 594.8808 625.7538 647.7601 668.6444 687.7146 718.1890 729.3745 759.7704 789.4941 807.6546 836.0901 887.8052 934.9215 958.7979 977.9373 979.7314 994.5186 1011.1459 1012.5183 1028.1022 1039.1376 1054.2113 1069.8747 1120.4473 1137.0029 1169.9866 1176.0742 1237.3024 1248.0977 1277.0064 1306.3310 1385.8436 1391.0980 1399.8877 1426.3563 1455.8413 1467.0611 1531.6810 1560.6269 1579.8875 1602.6186 1616.5397 3135.9560 3147.4717 3147.8086 3155.8874 3159.7109 3173.6688 3178.2978
redmass: 15.1192 8.8084 7.5835 10.6738 4.9878 5.9562 8.0005 8.3979 6.5703 11.0716 8.4493 8.3975 9.3414 9.4396 3.5936 10.2657 11.2064 3.2767 7.8538 11.1056 3.9501 11.7529 5.3305 8.1009 7.4400 9.9293 7.5902 4.6737 7.9082 4.0283 1.5084 7.7739 2.8574 1.3821 1.4235 8.0510 1.5803 1.3786 1.3945 6.4792 1.3500 7.2636 3.8967 4.4870 3.8462 3.1399 1.8119 2.4805 1.4732 1.0707 1.5553 2.0304 2.0303 2.5338 9.8817 9.1535 4.2766 2.4097 2.3930 2.6896 10.3542 7.1235 7.9454 6.2188 6.6599 1.0867 1.0900 1.0898 1.0922 1.0943 1.1007 1.0961
irintensity: 0.0492 1.3227 2.1680 0.2609 0.0563 0.7526 0.2014 1.7924 0.2933 0.1566 10.6672 2.0045 7.9200 4.3276 1.2606 1.7360 0.3152 0.0087 2.1328 35.5800 6.5498 1.1883 16.4884 11.9844 8.8660 0.4206 0.0238 2.7454 1.8153 0.1062 92.7916 13.6588 2.8458 55.4951 0.2738 25.3491 63.9241 4.2664 0.6833 178.8512 0.7556 160.4465 33.8291 22.1859 17.6585 139.6344 10.8452 24.0213 11.0920 5.3424 0.7119 351.5796 215.7510 45.8322 5.4718 8.4187 3.4103 63.2034 15.1834 3.6839 140.5008 2.4998 53.3615 100.7860 68.7260 0.9747 2.0090 6.4147 7.0905 3.5262 26.2595 1.4555
temp: 298.150 k
press: 1.00000 atm
elementType: 16 9 9 9 8 6 6 6 6 6 6 6 6 6 6 6 6 6 6 1 1 1 1 1 1 1
symmnumber: 1
zpe: 448714.1 jmol-1
zpe.correction: 0.170906 hartree
zpe.thermalcorrener: 0.185131 hartree
zpe.thermalcorrenthalpy: 0.186075 hartree
zpe.thermalcorrgfe: 0.129185 hartree
zpe.sumelectzpe: -1309.217899 hartree
zpe.sumelectthermal: -1309.203675 hartree
zpe.sumelectthermalent: -1309.202730 hartree
zpe.sumelectthermalfe: -1309.259620 hartree
dipole: -5.1389 3.9274 0.0036
dipole: 6.4678
quadrupole: -106.8926 -111.6950 -119.6832
quadrupole: 6.8237 -0.0163 -0.0170
quadrupole: 5.8643 1.0620 -6.9263 6.8237 -0.0163 -0.0170
hfenergy: -1309.3888056 hartree
pointgroup: C01 [X(C14H7F3O1S1)]
dipole: -1.9650345 1.6165091 0.0247612 debye
dipolederiv: -0.6981213 -0.0759201 0.0084611 -0.0238549 -0.1585864 0.000044 0.0083149 0.0008991 0.0551741 -0.8522077 -0.2275837 0.0065729 -0.171546 -0.4988306 0.0021797 0.0062911 0.0027501 -0.2881782 -0.6096228 0.1439387 -0.0963661 0.3346802 -0.4771466 0.2587703 -0.1802532 0.222464 -0.6281716 -0.6028027 0.1388883 0.0957038 0.3286621 -0.4775003 -0.2663248 0.17889 -0.22549 -0.6337952 -0.6369663 0.0798112 0.003836 0.0844494 -1.0237108 -0.0025034 0.0038405 -0.0022527 -0.3218908 -0.5949311 -0.2261343 0.0065259 0.0017392 -0.3970218 -0.0005747 0.0069051 0.0020104 0.0167073 0.9740793 -0.2936827 -0.0115885 -0.2441036 0.0996664 0.0029899 -0.0112057 0.0035082 -0.0432263 -0.7122066 0.1887935 0.0087385 0.054441 -0.26301 -0.0010201 0.0081984 -0.0026557 0.0123483 1.3871848 0.028863 -0.0144342 0.061324 1.0983826 0.0015633 -0.0143244 0.0016312 0.1526868 0.6804708 0.4916795 -0.0079087 0.2990859 0.3037638 -0.0030109 -0.0080084 -0.0053172 -0.043262 0.2130534 0.091205 -0.0026751 -0.0250387 0.0077016 0.0003245 -0.0031524 -0.0009583 -0.0388421 -0.5881982 -0.0244848 0.0045498 0.1425738 -0.2446028 -0.0017172 0.0053021 0.0000644 -0.1801211 -0.6391959 0.0370029 0.0058152 0.0286809 0.1432456 -0.0000982 0.0057061 -0.0002036 -0.1217789 0.1766483 -0.0018206 -0.0029711 -0.2738518 0.1721857 0.0033276 -0.0033573 0.0002926 -0.0905634 0.071719 -0.1645819 -0.0019991 0.1034273 0.0244655 -0.0012598 -0.0015505 0.0020606 -0.087217 -0.4665588 -0.2579453 0.0036142 -0.2682719 0.0171052 0.0031285 0.0037121 0.0030017 -0.1368948 2.3928685 -0.15496 -0.0096108 -0.6049099 1.3936885 0.0065661 -0.0090389 0.0013866 1.5517925 -0.0557106 0.2550734 -0.0011781 0.122398 -0.0854905 -0.0015804 -0.0013623 -0.0030589 -0.1633763 0.1817715 -0.0156011 -0.0034699 0.0578089 0.2025805 -0.0004926 -0.0034424 0.0002584 -0.1199726 0.1560829 -0.012167 -0.0000924 0.0605302 0.0731883 -0.0007097 0.0001116 0.0000303 0.1487062 0.0889257 0.0621096 0.0008264 0.0135711 -0.0343199 -0.0003436 0.0008079 -0.0008459 0.1603982 0.0378276 -0.0666761 0.0012891 -0.0572729 0.0738448 0.0005408 0.0013196 0.0006685 0.1609038 0.12652 0.0576789 0.0003366 -0.0173265 0.0243748 0.0002038 0.0002755 -0.0008058 0.1543525 0.1067344 -0.0075147 0.0006554 0.0514706 -0.0562347 -0.0006718 0.0006095 -0.0000134 0.1625963 -0.0301591 -0.0918826 0.0022731 -0.1077442 -0.0001167 0.0012508 0.0022761 0.0011102 0.1632097 -0.1072051 0.0459109 0.0030962 0.0490779 0.0823779 -0.0005821 0.003135 -0.0005347 0.1584146 unknown
polarizability: 283.360802|7.8538462|181.9735121|-2.4190387|0.002433|69.8810645 unknown
InChI: InChI=1S/C14H7F3OS/c15-14(16,17)8-5-6-12-10(7-8)13(18)9-3-1-2-4-11(9)19-12/h1-7H
charge 0 multiplicity 1
26 atoms
S  -1.535664 2.186352 0.041337
F  5.048103 0.531563 -0.033811
F  4.240578 -1.256946 1.106918
F  4.214974 -1.258163 -1.154118
O  -0.697846 -2.307462 0.025761
C  0.199217 -0.083438 0.020113
C  0.05977 1.332652 0.023085
C  -2.345999 -0.561683 0.04916
C  -0.93896 -1.05596 0.031456
C  -2.72431 0.808764 0.054248
C  1.509975 -0.630005 0.005067
C  2.641664 0.20035 -0.006449
C  1.20555 2.170929 0.011316
C  2.491002 1.611187 -0.003335
C  -3.380978 -1.542716 0.061125
C  -4.090765 1.18655 0.07019
C  4.007013 -0.425456 -0.021615
C  -4.734423 -1.177331 0.077209
C  -5.090412 0.196993 0.081554
H  1.591372 -1.722324 0.002747
H  1.085927 3.259178 0.013639
H  3.372687 2.257924 -0.012416
H  -3.066462 -2.591252 0.056799
H  -4.366062 2.246832 0.073695
H  -5.512887 -1.946586 0.086344
H  -6.144265 0.494649 0.093882
