program: Orca
programVersion: 5.0.4
elementType: O O O O O O C C C C C C C C C C C C C C C C C C C C C C C C C C H H H H H H H H H H H H H H H H H H H H H H H H H H H H
charge: 0
multiplicity: 1
keywords: wb97x-d3
keywords: def2-TZVPP
keywords: def2/J RIJCOSX
keywords: DEFGRID2
keywords: scfconv7
keywords: smallprint printgap noloewdin
keywords: NOSOSCF
formula: C26H28O6
InChI: InChI=1/C26H28O6/c1-5-6-10-21-17(2)20-13-12-19(14-24(20)32-26(21)28)31-15-18-9-7-8-11-22(18)23(16-29-3)25(27)30-4/h7-9,11-14,16H,5-6,10,15H2,1-4H3
60 atoms
O  2.831982 -0.072703 -1.20319
O  -1.559972 1.528763 -0.428684
O  4.781722 -0.95728 -1.613895
O  -3.08116 -0.019634 1.656957
O  -4.505046 -2.71466 -1.832192
O  -2.304101 -2.114032 1.598405
C  6.138528 0.326369 0.512148
C  4.680156 0.538289 0.223474
C  6.378906 -0.861011 1.44654
C  3.849589 1.305321 0.979975
C  2.450574 1.400683 0.627554
C  7.856998 -1.099526 1.721794
C  1.986144 0.690659 -0.472755
C  4.148259 -0.207687 -0.901476
C  4.309365 2.052957 2.188349
C  1.50634 2.162736 1.333569
C  0.660058 0.705515 -0.883453
C  -0.24935 1.455292 -0.152894
C  0.186236 2.194744 0.958036
C  8.096022 -2.25303 2.683615
C  -2.087516 0.758473 -1.509036
C  -3.581333 0.850604 -1.434249
C  -4.339102 -0.122814 -0.772678
C  -4.223546 1.938182 -2.018876
C  -5.725284 0.012371 -0.728834
C  -3.709475 -1.313499 -0.15341
C  -5.602641 2.067044 -1.964287
C  -6.355757 1.097683 -1.317338
C  -2.95686 -1.218387 1.099077
C  -3.838821 -2.534395 -0.704141
C  -2.353129 0.229191 2.857919
C  -4.651119 -4.062292 -2.275753
H  6.678425 0.165053 -0.422695
H  6.572557 1.225639 0.950636
H  5.937848 -1.763682 1.012585
H  5.853105 -0.686034 2.390781
H  8.373756 -1.296112 0.777705
H  8.301548 -0.186084 2.127955
H  3.760183 1.719125 3.070482
H  5.36755 1.925059 2.392068
H  4.114638 3.121243 2.080354
H  1.814979 2.737881 2.195652
H  0.376171 0.131072 -1.754697
H  -0.528485 2.783459 1.518227
H  7.622536 -2.067018 3.649541
H  9.160135 -2.409457 2.864725
H  7.688498 -3.187176 2.292755
H  -1.721943 1.159831 -2.458755
H  -1.758976 -0.281674 -1.435492
H  -3.632936 2.687592 -2.532355
H  -6.314346 -0.741209 -0.221314
H  -6.08672 2.916736 -2.427321
H  -7.433515 1.183904 -1.272458
H  -3.399235 -3.413777 -0.239608
H  -1.282398 0.07933 2.719709
H  -2.538657 1.269504 3.109908
H  -2.703738 -0.402687 3.674378
H  -5.232474 -4.028797 -3.193008
H  -3.680843 -4.515315 -2.482912
H  -5.183559 -4.662574 -1.53726
elementType: O C H
totalener: -1459.12792228 hartree
nucrepener: 3130.24453495 hartree
electener: -4589.37245723 hartree
oneelecener: -8212.18284411 hartree
twoeener: 3622.81038689 hartree
cpcmener: -0.05769235 hartree
kineticenergy: 1452.83157397 hartree
xcener: -140.263642806902 hartree
chargesum: -0.0000000
charge: -0.239307 -0.313221 -0.494579 -0.288910 -0.295647 -0.521505 -0.124866 -0.035490 -0.126873 0.021662 -0.069833 -0.090843 0.122000 0.420026 -0.287030 -0.073058 -0.175936 0.350385 -0.315184 -0.279182 0.046118 -0.104969 0.028910 -0.141988 -0.188953 -0.219052 -0.175857 -0.146509 0.529400 0.259227 -0.154600 -0.124752 0.087398 0.097065 0.076268 0.073375 0.059555 0.058295 0.118052 0.100596 0.118017 0.158251 0.131619 0.144569 0.078632 0.090672 0.078555 0.136754 0.135363 0.145350 0.148045 0.160560 0.161075 0.109490 0.114496 0.130280 0.133364 0.123148 0.120866 0.120704
qa: -0.2393 -0.3132 -0.4946 -0.2889 -0.2956 -0.5215 -0.1249 -0.0355 -0.1269 0.0217 -0.0698 -0.0908 0.1220 0.4200 -0.2870 -0.0731 -0.1759 0.3504 -0.3152 -0.2792 0.0461 -0.1050 0.0289 -0.1420 -0.1890 -0.2191 -0.1759 -0.1465 0.5294 0.2592 -0.1546 -0.1248 0.0874 0.0971 0.0763 0.0734 0.0596 0.0583 0.1181 0.1006 0.1180 0.1583 0.1316 0.1446 0.0786 0.0907 0.0786 0.1368 0.1354 0.1453 0.1480 0.1606 0.1611 0.1095 0.1145 0.1303 0.1334 0.1231 0.1209 0.1207
va: 2.1834 2.0647 2.0119 2.1070 2.1146 1.9853 3.8361 3.4233 3.8340 3.7105 3.7407 3.8692 4.0845 4.2731 3.9516 3.8464 3.9146 3.7598 4.0241 3.9459 3.7445 3.7870 3.5312 3.9154 3.9429 3.4390 3.9089 3.8941 4.0875 3.9570 3.8667 3.8587 1.0240 1.0017 1.0170 1.0088 1.0081 1.0079 0.9921 1.0065 0.9952 0.9931 1.0275 1.0105 1.0007 1.0041 1.0007 0.9910 0.9806 1.0026 1.0051 0.9902 0.9895 1.0260 0.9912 0.9930 0.9958 0.9939 0.9851 0.9857
dispcorr: -0.029837087 hartree
energy: -1459.157759365393
dipole: 28.21157 -30.18095 -1.96938 -6.03048 7.11471 1.08423 15.54218 -14.57607 0.96611
magnitude: 2.44691 au
magnitude: 6.21955 debye
