program: Orca
programVersion: 5.0.4
elementType: O O O O O O C C C C C C C C C C C C C C C C C C C C C C C C C C H H H H H H H H H H H H H H H H H H H H H H H H H H H H
charge: 0
multiplicity: 1
keywords: wb97x-d3
keywords: def2-TZVPP
keywords: def2/J RIJCOSX
keywords: DEFGRID2
keywords: scfconv7
keywords: smallprint printgap noloewdin
keywords: NOSOSCF
formula: C26H28O6
InChI: InChI=1/C26H28O6/c1-5-6-10-21-17(2)20-13-12-19(14-24(20)32-26(21)28)31-15-18-9-7-8-11-22(18)23(16-29-3)25(27)30-4/h7-9,11-14,16H,5-6,10,15H2,1-4H3
60 atoms
O  2.44266 0.013876 1.853318
O  -1.290195 1.11035 -0.850826
O  4.094253 -0.397435 3.211035
O  -4.372358 -1.19732 1.475202
O  -2.901522 -0.6154 -2.887058
O  -3.316245 -2.911729 0.506057
C  5.937395 -1.188513 1.171865
C  4.515011 -0.77776 0.904969
C  6.950183 -0.070777 0.903126
C  3.969446 -0.718644 -0.340499
C  2.609734 -0.258291 -0.504483
C  6.770885 1.165965 1.774105
C  1.883638 0.100628 0.624408
C  3.722489 -0.391037 2.056519
C  4.723282 -1.100999 -1.571992
C  1.961539 -0.127853 -1.742757
C  0.576103 0.563604 0.572275
C  -0.035435 0.675363 -0.667721
C  0.669071 0.32645 -1.830433
C  7.819542 2.230323 1.488294
C  -2.105755 1.365653 0.288742
C  -3.510594 1.560757 -0.192481
C  -4.253026 0.473012 -0.667095
C  -4.082919 2.826779 -0.171302
C  -5.555333 0.681125 -1.107843
C  -3.669072 -0.89025 -0.707069
C  -5.385474 3.025308 -0.608514
C  -6.122365 1.94865 -1.078425
C  -3.753211 -1.778402 0.451922
C  -3.037167 -1.354613 -1.799765
C  -4.497259 -1.951045 2.68072
C  -2.190805 -1.212411 -3.972294
H  6.037803 -1.522655 2.205024
H  6.191741 -2.054219 0.558453
H  6.897986 0.219952 -0.150981
H  7.954871 -0.475734 1.057323
H  5.776771 1.594103 1.614457
H  6.817338 0.880072 2.828853
H  5.706471 -1.508727 -1.360642
H  4.169582 -1.845828 -2.145427
H  4.855977 -0.234105 -2.221895
H  2.48274 -0.388041 -2.653532
H  0.079068 0.833794 1.494237
H  0.185795 0.421973 -2.794391
H  8.828753 1.854107 1.668301
H  7.678319 3.108145 2.120018
H  7.773953 2.563184 0.449517
H  -2.051732 0.526204 0.988572
H  -1.750892 2.258131 0.812344
H  -3.5027 3.665837 0.193845
H  -6.133367 -0.158357 -1.473962
H  -5.819285 4.016374 -0.583679
H  -7.138246 2.092001 -1.422754
H  -2.61473 -2.356072 -1.823709
H  -5.013524 -1.304192 3.384348
H  -5.08556 -2.856187 2.529239
H  -3.52251 -2.217191 3.090425
H  -2.73656 -2.069656 -4.369643
H  -2.103753 -0.454179 -4.746305
H  -1.192907 -1.526979 -3.664789
elementType: O C H
totalener: -1459.12762311 hartree
nucrepener: 3165.11498579 hartree
electener: -4624.24260890 hartree
oneelecener: -8281.60183782 hartree
twoeener: 3657.35922892 hartree
cpcmener: -0.05865855 hartree
kineticenergy: 1452.82812929 hartree
xcener: -140.264444267510 hartree
chargesum: 0.0000000
charge: -0.240500 -0.308154 -0.491322 -0.294708 -0.296675 -0.523764 -0.127821 -0.059444 -0.141199 0.038434 -0.070906 -0.077965 0.122973 0.426278 -0.295381 -0.099648 -0.168881 0.318390 -0.266292 -0.285559 0.065548 -0.152702 0.032063 -0.107891 -0.161295 -0.209227 -0.166735 -0.161557 0.528989 0.234007 -0.139794 -0.141432 0.092390 0.101531 0.072533 0.077126 0.059535 0.058877 0.100104 0.116570 0.122770 0.157052 0.130321 0.161311 0.080130 0.090827 0.079262 0.128249 0.127480 0.143642 0.146654 0.160608 0.160410 0.112853 0.125309 0.118893 0.117315 0.134408 0.128179 0.117829
qa: -0.2405 -0.3082 -0.4913 -0.2947 -0.2967 -0.5238 -0.1278 -0.0594 -0.1412 0.0384 -0.0709 -0.0780 0.1230 0.4263 -0.2954 -0.0996 -0.1689 0.3184 -0.2663 -0.2856 0.0655 -0.1527 0.0321 -0.1079 -0.1613 -0.2092 -0.1667 -0.1616 0.5290 0.2340 -0.1398 -0.1414 0.0924 0.1015 0.0725 0.0771 0.0595 0.0589 0.1001 0.1166 0.1228 0.1571 0.1303 0.1613 0.0801 0.0908 0.0793 0.1282 0.1275 0.1436 0.1467 0.1606 0.1604 0.1129 0.1253 0.1189 0.1173 0.1344 0.1282 0.1178
va: 2.1824 2.0800 2.0125 2.1047 2.0973 1.9870 3.8550 3.3903 3.8777 3.6791 3.7570 3.8450 4.0874 4.2557 3.9513 3.8907 3.9092 3.8280 4.0144 3.9585 3.7483 3.8528 3.4426 3.8743 3.9462 3.4005 3.9056 3.9045 4.0876 3.9797 3.8749 3.8508 1.0260 1.0015 1.0026 1.0117 1.0077 1.0107 1.0078 0.9964 0.9910 0.9964 1.0285 0.9982 1.0008 1.0027 1.0007 0.9912 0.9953 1.0049 1.0060 0.9903 0.9901 1.0267 0.9959 0.9928 0.9928 0.9886 0.9916 0.9835
dispcorr: -0.030721895 hartree
energy: -1459.158345008343
dipole: 30.99806 -31.52736 -0.52929 2.77347 -2.43204 0.34143 -4.08723 0.73901 -3.34821
magnitude: 3.40694 au
magnitude: 8.65976 debye
