program: Gaussian 09
title: 000074320
version: EM64L-G09RevD.01
frameworkgroup: C1[X(C9H5I2NO2)]
method: RPBEPBE
basis: SDD
operation: Freq
keyword: #p
keyword: freq=noraman
keyword: PBEPBE/SDD
title: #p freq=noraman PBEPBE/SDD
converged: YES YES NO NO
title: Mulliken charges:
elementType: I I O O N C C C C C C C C C H H H H H
charge: 0.165819 0.165881 -0.283631 -0.173767 -0.002292 0.650244 -0.453426 -0.453545 0.411046 -0.323190 -0.323244 0.259289 -0.736090 -0.247448 0.281124 0.281140 0.264166 0.253759 0.264164
chargesum: 0.00000
title: Mulliken charges with hydrogens summed into heavy atoms:
elementType: I I O O N C C C C C C C C C
charge: 0.165819 0.165881 -0.283631 -0.173767 -0.002292 0.650244 -0.453426 -0.453545 0.411046 -0.042066 -0.042104 0.259289 0.045998 -0.247448
polarizability: 1.97502685e+02 -2.81774544e-02 2.09483165e+02 -9.12642672e-03 9.60427916e+00 6.84164904e+01
1716.lowfreq: -6.2382 -0.0003 0.0001 0.0002 4.5493 6.8266 33.6322 38.2359 45.1297
frequency: 33.4887 38.2115 44.8982 80.5227 93.9278 98.6881 100.0152 133.7943 166.9076 192.4230 224.4294 270.2956 298.2198 302.5779 438.1579 455.7181 466.6228 492.5619 538.6258 584.0569 590.6931 619.5760 669.3545 699.2306 762.9648 812.0720 873.0445 901.2037 904.3429 980.4504 1031.4329 1040.7875 1140.9657 1195.8469 1203.8559 1222.7408 1339.8782 1373.5991 1383.7081 1420.6476 1449.6064 1450.9588 1523.6786 1574.8873 1709.0883 2185.1944 3009.4056 3097.1447 3148.4770 3181.6636 3184.1546
redmass: 9.6395 8.5236 2.2918 13.4256 21.6014 4.2062 1.5975 9.6964 4.5240 12.4684 10.9652 9.6402 9.2044 4.9591 5.6910 6.4487 7.3976 5.1290 3.5237 7.4799 7.1496 4.8328 4.0613 10.0381 7.4467 9.2213 8.5773 1.3601 1.5714 2.3459 4.2340 1.6381 2.6099 2.0215 1.7477 6.6286 4.8031 3.6210 1.2361 3.6021 1.0459 1.0554 8.9636 6.8050 10.7264 12.6305 1.0368 1.0972 1.1014 1.0932 1.0942
irintensity: 0.0024 0.0678 3.7152 0.1201 0.0201 2.0114 0.1377 5.5013 0.0445 1.7660 3.3629 3.5716 3.7799 3.6306 1.6290 1.8043 3.0526 0.0265 4.7711 11.7344 4.9705 25.0126 3.2222 64.4090 22.1333 101.0164 41.7508 0.0030 41.9833 121.0998 18.4811 6.1397 415.7822 19.3849 10.4084 43.9433 3.7809 29.0544 77.4741 68.9206 19.0639 25.1206 83.4697 3.6406 168.6646 23.7394 0.1849 2.7705 7.4245 0.9230 0.0254
temp: 298.150 k
press: 1.00000 atm
elementType: 53 53 8 8 7 6 6 6 6 6 6 6 6 6 1 1 1 1 1
symmnumber: 1
zpe: 303461.5 jmol-1
zpe.correction: 0.115582 hartree
zpe.thermalcorrener: 0.130154 hartree
zpe.thermalcorrenthalpy: 0.131098 hartree
zpe.thermalcorrgfe: 0.069320 hartree
zpe.sumelectzpe: -573.163399 hartree
zpe.sumelectthermal: -573.148827 hartree
zpe.sumelectthermalent: -573.147883 hartree
zpe.sumelectthermalfe: -573.209661 hartree
dipole: 0.0039 -4.4249 -1.6969
dipole: 4.7391
quadrupole: -98.7600 -120.2113 -117.7408
quadrupole: 0.0014 0.0001 0.1057
quadrupole: 13.4774 -7.9739 -5.5035 0.0014 0.0001 0.1057
hfenergy: -573.2789809 hartree
pointgroup: C01 [X(C9H5I2N1O2)]
dipole: 1.7421701 0.0003819 -0.6642467 debye
dipolederiv: -0.0606139 -0.2146815 0.0273634 -0.1965173 -0.3297251 0.0240838 0.0134416 0.0350035 0.0545776 -0.0603895 0.2146455 0.0272893 0.1964115 -0.3299558 -0.0239927 0.0134374 -0.0348993 0.0546058 -1.9280251 -0.0002167 -0.4765299 -0.000093 -0.2735498 -0.0001345 -0.4638739 -0.000169 -0.6904004 -0.5534832 -0.0001389 0.1883574 -0.0002796 -0.2420932 -0.0000002 -0.3835893 0.0002355 -0.9406123 -0.418492 0.0002109 0.0116244 0.0001196 -0.1952957 0.0000175 0.0203201 -0.0000302 -0.2312221 0.9868202 -0.0002683 0.1913124 -0.0004446 -0.3595015 -0.000068 -0.2200627 0.0000129 0.0616866 0.0315847 0.497197 -0.1099017 0.5552507 0.8448899 -0.0960117 -0.015812 -0.0632889 -0.1313379 0.0307717 -0.4968591 -0.1097075 -0.5547462 0.8459046 0.0958927 -0.0157596 0.063333 -0.1313569 -0.0452912 0.0001144 0.0093922 0.0002942 0.3145009 -0.0000419 0.0175013 -0.0000303 0.1318565 -0.1102544 -0.1703673 0.0075287 -0.0967422 -0.297481 0.0334155 -0.0021276 0.0225379 -0.0757458 -0.1099506 0.1704954 0.0074575 0.0965265 -0.2976293 -0.0333688 -0.0022308 -0.0226206 -0.0757534 1.8615743 0.0006313 0.1896027 0.001181 0.2114886 0.0000275 1.0050703 -0.0002761 1.5469704 -0.3969874 -0.0006257 0.1101569 -0.0016256 0.0183786 0.0005467 0.1747278 0.0001778 -0.0954865 0.3940108 -0.00039 -0.0291225 -0.0003378 -0.1190055 0.0000097 -0.04201 0.0000661 0.0274053 0.0771379 0.0434249 0.004223 0.0463309 0.0367889 -0.0041883 0.0124218 -0.0039489 0.1637541 0.0770517 -0.0434828 0.0042367 -0.0464172 0.0368854 0.0042018 0.0124439 0.0039331 0.1637572 0.1143615 -0.0247631 0.0008849 0.0298823 0.0073726 -0.0896254 -0.0132184 -0.0768044 0.0844834 -0.0041247 0.0003002 -0.0553672 0.0007809 0.1220468 0.0003856 -0.0976434 0.00055 -0.0031321 0.1142993 0.0247738 0.0011992 -0.029574 0.0059805 0.0888507 -0.0130364 0.076218 0.0859505 unknown
polarizability: 209.5198205|0.019934|197.5026527|-9.3313655|-0.01391|68.3798669 unknown
InChI: InChI=1S/C9H5I2NO2/c1-5(13)14-9-7(10)2-6(4-12)3-8(9)11/h2-3H,1H3
charge 0 multiplicity 1
19 atoms
I  0.909645 3.083675 -0.39659
I  0.907319 -3.085164 -0.396019
O  1.965159 -0.001206 -0.569595
O  2.461703 -0.000725 1.73126
N  -4.85209 0.000848 0.301527
C  0.57719 -0.000639 -0.331744
C  -0.135038 1.22358 -0.252066
C  -0.135985 -1.22429 -0.251835
C  -2.234776 0.000486 -0.00263
C  -1.53254 1.232406 -0.087386
C  -1.533497 -1.23199 -0.087152
C  2.868946 -0.000857 0.563431
C  4.281438 -0.000333 0.046393
C  -3.664503 0.001094 0.164153
H  -2.08052 2.175255 -0.024123
H  -2.082203 -2.174405 -0.023702
H  4.445715 -0.88702 -0.590091
H  4.987067 -0.004244 0.888803
H  4.447269 0.891531 -0.582535
