program: Orca
programVersion: 5.0.4
elementType: O O O O O O C C C C C C C C C C C C C C C C C C C C C C C C C C H H H H H H H H H H H H H H H H H H H H H H H H H H H H
charge: 0
multiplicity: 1
keywords: wb97x-d3
keywords: def2-TZVPP
keywords: def2/J RIJCOSX
keywords: DEFGRID2
keywords: scfconv7
keywords: smallprint printgap noloewdin
keywords: NOSOSCF
formula: C26H28O6
InChI: InChI=1/C26H28O6/c1-5-6-10-21-17(2)20-13-12-19(14-24(20)32-26(21)28)31-15-18-9-7-8-11-22(18)23(16-29-3)25(27)30-4/h7-9,11-14,16H,5-6,10,15H2,1-4H3
60 atoms
O  2.602874 0.628312 -1.364806
O  -1.862363 1.886054 -0.380831
O  4.601535 -0.011051 -1.952985
O  -3.903733 0.135559 1.871192
O  -1.73775 -1.641549 -1.834132
O  -2.131545 -1.173467 2.23095
C  5.666395 -0.073711 0.673336
C  4.246178 0.307481 0.369732
C  5.83872 -1.578304 0.880678
C  3.311371 0.594057 1.315601
C  1.969705 0.942522 0.908317
C  7.281081 -1.965984 1.173873
C  1.661637 0.949046 -0.446304
C  3.87284 0.289815 -1.031182
C  3.602551 0.559142 2.779645
C  0.935862 1.287228 1.792471
C  0.40606 1.271607 -0.939745
C  -0.600027 1.585737 -0.037769
C  -0.321077 1.602147 1.337243
C  7.447087 -3.457668 1.417745
C  -2.346534 1.594699 -1.688762
C  -3.713351 0.981359 -1.598666
C  -3.955466 -0.158951 -0.822196
C  -4.748787 1.534803 -2.344044
C  -5.234937 -0.708482 -0.813755
C  -2.89155 -0.783189 0.002248
C  -6.017193 0.97353 -2.335196
C  -6.260881 -0.153252 -1.564615
C  -2.915035 -0.651164 1.461202
C  -1.858086 -1.460129 -0.528321
C  -4.051848 0.335586 3.275799
C  -0.524498 -2.254824 -2.270881
H  6.31578 0.25642 -0.139774
H  6.014894 0.456136 1.560806
H  5.488019 -2.114124 -0.006779
H  5.198097 -1.901653 1.707382
H  7.917191 -1.656105 0.339435
H  7.633545 -1.409945 2.047859
H  2.925848 -0.133654 3.282509
H  4.617693 0.249145 3.005192
H  3.442151 1.540592 3.229506
H  1.119239 1.300057 2.857958
H  0.256438 1.27556 -2.010677
H  -1.106249 1.857954 2.037137
H  6.851177 -3.787858 2.270695
H  8.486406 -3.716847 1.623566
H  7.129017 -4.03934 0.550485
H  -2.380953 2.520095 -2.267775
H  -1.679853 0.911955 -2.216983
H  -4.556947 2.41988 -2.938666
H  -5.427887 -1.590122 -0.214988
H  -6.80933 1.418199 -2.923112
H  -7.245927 -0.600498 -1.545048
H  -1.082686 -1.887144 0.10321
H  -4.229638 -0.604392 3.798608
H  -3.180888 0.83062 3.705773
H  -4.920437 0.977219 3.394418
H  -0.584405 -2.334752 -3.352739
H  0.341283 -1.646944 -2.003531
H  -0.414951 -3.252245 -1.842942
elementType: O C H
totalener: -1459.12586284 hartree
nucrepener: 3250.00485637 hartree
electener: -4709.13071922 hartree
oneelecener: -8451.19486254 hartree
twoeener: 3742.06414332 hartree
cpcmener: -0.05487169 hartree
kineticenergy: 1452.83774184 hartree
xcener: -140.269949897427 hartree
chargesum: -0.0000000
charge: -0.243413 -0.319802 -0.494976 -0.284373 -0.297595 -0.518902 -0.119032 -0.034138 -0.130967 0.011220 -0.059444 -0.091891 0.213443 0.418625 -0.288256 -0.083381 -0.263822 0.328061 -0.284054 -0.279017 0.017899 -0.149148 0.019160 -0.073033 -0.222748 -0.060976 -0.174317 -0.151021 0.473513 0.218764 -0.135254 -0.121908 0.088388 0.096496 0.077225 0.074176 0.059685 0.059167 0.117962 0.099375 0.119629 0.156334 0.135795 0.151686 0.078727 0.090390 0.079020 0.112288 0.130917 0.143432 0.144634 0.161250 0.159899 0.117942 0.118669 0.113430 0.125613 0.127073 0.113750 0.127831
qa: -0.2434 -0.3198 -0.4950 -0.2844 -0.2976 -0.5189 -0.1190 -0.0341 -0.1310 0.0112 -0.0594 -0.0919 0.2134 0.4186 -0.2883 -0.0834 -0.2638 0.3281 -0.2841 -0.2790 0.0179 -0.1491 0.0192 -0.0730 -0.2227 -0.0610 -0.1743 -0.1510 0.4735 0.2188 -0.1353 -0.1219 0.0884 0.0965 0.0772 0.0742 0.0597 0.0592 0.1180 0.0994 0.1196 0.1563 0.1358 0.1517 0.0787 0.0904 0.0790 0.1123 0.1309 0.1434 0.1446 0.1612 0.1599 0.1179 0.1187 0.1134 0.1256 0.1271 0.1137 0.1278
va: 2.1640 2.0829 2.0125 2.1102 2.1073 1.9829 3.8334 3.4137 3.8331 3.7155 3.7341 3.8676 3.9330 4.2789 3.9537 3.8787 3.8613 3.7971 3.9910 3.9459 3.8461 3.8276 3.4707 3.8486 3.9813 3.3242 3.9166 3.8941 4.1279 3.9517 3.8757 3.8485 1.0232 1.0014 1.0171 1.0086 1.0081 1.0078 0.9923 1.0060 0.9946 0.9953 1.0255 1.0041 1.0007 1.0042 1.0006 1.0043 0.9982 1.0031 1.0076 0.9898 0.9906 1.0245 0.9941 0.9899 0.9957 0.9936 0.9827 0.9885
dispcorr: -0.033182388 hartree
energy: -1459.159045230960
dipole: 28.15381 -29.34258 -1.18878 -13.82904 14.10629 0.27725 12.98753 -11.77383 1.21369
magnitude: 1.72137 au
magnitude: 4.37538 debye
