program: Orca
programVersion: 5.0.4
elementType: O O O O O O C C C C C C C C C C C C C C C C C C C C C C C C C C H H H H H H H H H H H H H H H H H H H H H H H H H H H H
charge: 0
multiplicity: 1
keywords: wb97x-d3
keywords: def2-TZVPP
keywords: def2/J RIJCOSX
keywords: DEFGRID2
keywords: scfconv7
keywords: smallprint printgap noloewdin
keywords: NOSOSCF
formula: C26H28O6
InChI: InChI=1/C26H28O6/c1-5-6-10-21-17(2)20-13-12-19(14-24(20)32-26(21)28)31-15-18-9-7-8-11-22(18)23(16-29-3)25(27)30-4/h7-9,11-14,16H,5-6,10,15H2,1-4H3
60 atoms
O  1.691159 1.907163 0.231851
O  -2.02116 0.722756 -2.462228
O  3.254322 2.464841 1.643554
O  -0.78054 -1.207124 0.875234
O  -4.662126 -0.95429 -1.667074
O  -1.363379 -2.996788 -0.325285
C  5.011279 0.335949 0.977039
C  3.685244 0.552662 0.307707
C  4.908428 -0.617172 2.168642
C  3.165423 -0.274382 -0.638615
C  1.85082 -0.006885 -1.174798
C  6.243835 -0.818993 2.870648
C  1.145717 1.093049 -0.70252
C  2.908569 1.680834 0.785241
C  3.884375 -1.48182 -1.142543
C  1.206208 -0.815205 -2.123139
C  -0.137424 1.411408 -1.122484
C  -0.758494 0.567898 -2.030035
C  -0.07255 -0.542516 -2.54245
C  6.159716 -1.810399 4.020348
C  -2.869366 1.655055 -1.821684
C  -3.098753 1.454355 -0.340221
C  -3.061112 0.227568 0.334833
C  -3.404819 2.611314 0.377395
C  -3.327023 0.210573 1.707256
C  -2.767974 -1.069322 -0.32022
C  -3.679462 2.576642 1.732853
C  -3.636432 1.363583 2.405672
C  -1.594528 -1.865199 0.057293
C  -3.5695 -1.58481 -1.268795
C  0.391012 -1.879947 1.334805
C  -5.357019 -1.529542 -2.771928
H  5.734978 -0.056304 0.260924
H  5.416667 1.291567 1.312438
H  4.525077 -1.583348 1.824641
H  4.172653 -0.232257 2.881884
H  6.984555 -1.164891 2.143356
H  6.607214 0.144114 3.240782
H  3.304881 -2.382301 -0.929906
H  4.00785 -1.432823 -2.225694
H  4.866589 -1.609787 -0.699091
H  1.710413 -1.684348 -2.521987
H  -0.621128 2.286733 -0.711169
H  -0.565781 -1.18979 -3.255671
H  7.125541 -1.937227 4.511041
H  5.837578 -2.793541 3.672309
H  5.447022 -1.480277 4.778403
H  -2.499155 2.672099 -1.987698
H  -3.817086 1.578735 -2.356942
H  -3.418673 3.562092 -0.143036
H  -3.304112 -0.736193 2.232613
H  -3.914492 3.491441 2.260733
H  -3.841753 1.315017 3.466841
H  -3.348162 -2.539007 -1.740389
H  0.997102 -2.258779 0.512636
H  0.962377 -1.139609 1.888489
H  0.134225 -2.703901 2.001492
H  -6.253448 -0.935017 -2.923871
H  -4.747549 -1.495918 -3.675502
H  -5.642721 -2.561417 -2.562821
elementType: O C H
totalener: -1459.12384026 hartree
nucrepener: 3373.61305092 hartree
electener: -4832.73689118 hartree
oneelecener: -8698.98318720 hartree
twoeener: 3866.24629601 hartree
cpcmener: -0.05571766 hartree
kineticenergy: 1452.84142227 hartree
xcener: -140.276436213759 hartree
chargesum: 0.0000000
charge: -0.240241 -0.331372 -0.493487 -0.282884 -0.297489 -0.523652 -0.113797 -0.029382 -0.128841 0.014866 -0.132211 -0.092085 0.225524 0.419034 -0.280776 -0.096203 -0.230996 0.367537 -0.283582 -0.278465 0.112092 -0.174080 0.071131 -0.127430 -0.227314 -0.129349 -0.177593 -0.155045 0.478137 0.242456 -0.147666 -0.128668 0.096459 0.085893 0.071728 0.078077 0.058356 0.059882 0.116437 0.120725 0.100933 0.154627 0.129791 0.139635 0.090475 0.078164 0.078461 0.124765 0.124675 0.139700 0.142679 0.161171 0.160324 0.109272 0.108799 0.124396 0.143800 0.123892 0.124663 0.124052
qa: -0.2402 -0.3314 -0.4935 -0.2829 -0.2975 -0.5237 -0.1138 -0.0294 -0.1288 0.0149 -0.1322 -0.0921 0.2255 0.4190 -0.2808 -0.0962 -0.2310 0.3675 -0.2836 -0.2785 0.1121 -0.1741 0.0711 -0.1274 -0.2273 -0.1293 -0.1776 -0.1550 0.4781 0.2425 -0.1477 -0.1287 0.0965 0.0859 0.0717 0.0781 0.0584 0.0599 0.1164 0.1207 0.1009 0.1546 0.1298 0.1396 0.0905 0.0782 0.0785 0.1248 0.1247 0.1397 0.1427 0.1612 0.1603 0.1093 0.1088 0.1244 0.1438 0.1239 0.1247 0.1241
va: 2.1806 2.0668 2.0139 2.1016 2.1246 1.9742 3.8277 3.4174 3.8433 3.6735 3.6156 3.8708 3.9358 4.2726 3.9492 3.8222 3.9408 3.6719 3.9934 3.9463 3.7302 3.6935 3.3584 3.8807 3.9819 3.4504 3.9136 3.8948 4.1075 3.9660 3.8655 3.8512 1.0018 1.0261 1.0086 1.0150 1.0076 1.0080 0.9913 0.9958 1.0063 0.9929 1.0305 1.0129 1.0042 1.0009 1.0007 0.9979 0.9932 1.0012 1.0095 0.9895 0.9905 1.0269 0.9907 0.9948 0.9960 0.9937 0.9861 0.9868
dispcorr: -0.036717006 hartree
energy: -1459.160557270509
dipole: 24.04061 -25.42902 -1.38841 -14.65148 13.13099 -1.52049 10.71139 -12.90346 -2.19207
magnitude: 3.00745 au
magnitude: 7.64432 debye
