program: Orca
programVersion: 5.0.4
elementType: O O O O O O C C C C C C C C C C C C C C C C C C C C C C C C C C H H H H H H H H H H H H H H H H H H H H H H H H H H H H
charge: 0
multiplicity: 1
keywords: wb97x-d3
keywords: def2-TZVPP
keywords: def2/J RIJCOSX
keywords: DEFGRID2
keywords: scfconv7
keywords: smallprint printgap noloewdin
keywords: NOSOSCF
formula: C26H28O6
InChI: InChI=1/C26H28O6/c1-5-6-10-21-17(2)20-13-12-19(14-24(20)32-26(21)28)31-15-18-9-7-8-11-22(18)23(16-29-3)25(27)30-4/h7-9,11-14,16H,5-6,10,15H2,1-4H3
60 atoms
O  2.023576 -0.584469 2.173032
O  -2.134989 1.358236 1.489094
O  3.828485 -1.750708 2.516457
O  -4.540616 -0.764996 0.898027
O  -0.443608 -1.037832 -1.282738
O  -2.964578 -2.077072 1.781504
C  5.362302 -0.548112 0.486456
C  3.962103 -0.108931 0.808779
C  5.399542 -1.844121 -0.337348
C  3.279428 0.882934 0.174334
C  1.889509 1.114865 0.507138
C  4.811912 -1.727976 -1.740448
C  1.296835 0.342156 1.503637
C  3.310988 -0.869835 1.863083
C  3.876562 1.745085 -0.88993
C  1.067175 2.038965 -0.14512
C  -0.038034 0.447471 1.839991
C  -0.833346 1.35377 1.150322
C  -0.27249 2.165952 0.159992
C  5.679952 -0.935141 -2.706436
C  -3.066158 2.047554 0.674836
C  -3.195308 1.538078 -0.740547
C  -2.977413 0.210253 -1.131965
C  -3.605166 2.467373 -1.693833
C  -3.174369 -0.134329 -2.470662
C  -2.508186 -0.846086 -0.206318
C  -3.808187 2.108804 -3.016056
C  -3.588331 0.796697 -3.408202
C  -3.323284 -1.298061 0.918734
C  -1.296663 -1.416947 -0.344873
C  -5.421199 -1.089428 1.972313
C  0.768582 -1.783939 -1.373011
H  5.89871 0.237486 -0.042937
H  5.916062 -0.708047 1.413544
H  4.876327 -2.631348 0.20962
H  6.440895 -2.171748 -0.410432
H  4.66954 -2.734724 -2.142192
H  3.810815 -1.287468 -1.6895
H  3.433023 1.517752 -1.861714
H  3.679057 2.798037 -0.686809
H  4.950834 1.626332 -0.980502
H  1.475404 2.667573 -0.924141
H  -0.465838 -0.193119 2.601186
H  -0.862486 2.891504 -0.381268
H  5.211594 -0.861356 -3.688843
H  6.65161 -1.414329 -2.841677
H  5.864189 0.082297 -2.359322
H  -4.018322 1.941996 1.196998
H  -2.839457 3.117928 0.656321
H  -3.759209 3.496745 -1.391593
H  -3.011194 -1.160359 -2.776251
H  -4.126481 2.851833 -3.735163
H  -3.736312 0.498659 -4.437696
H  -0.973201 -2.210077 0.324121
H  -5.619742 -2.160024 2.021091
H  -5.024882 -0.749921 2.929258
H  -6.349585 -0.564751 1.76457
H  1.410294 -1.258369 -2.074533
H  1.268846 -1.851287 -0.405758
H  0.575876 -2.790279 -1.748111
elementType: O C H
totalener: -1459.12320399 hartree
nucrepener: 3394.78383502 hartree
electener: -4853.90703902 hartree
oneelecener: -8740.42863785 hartree
twoeener: 3886.52159883 hartree
cpcmener: -0.05686929 hartree
kineticenergy: 1452.83913726 hartree
xcener: -140.278944248344 hartree
chargesum: -0.0000000
charge: -0.242665 -0.331054 -0.490231 -0.291780 -0.296890 -0.528191 -0.156062 -0.010113 -0.125235 -0.040436 -0.015091 -0.088528 0.174893 0.426982 -0.317689 -0.126557 -0.262847 0.344818 -0.209612 -0.285930 0.105848 -0.175079 0.061082 -0.130808 -0.219763 -0.117718 -0.172963 -0.156940 0.506653 0.196725 -0.141346 -0.137223 0.105803 0.094431 0.081898 0.075955 0.080144 0.030555 0.125723 0.124180 0.111495 0.155977 0.130409 0.142281 0.092794 0.086469 0.080389 0.127014 0.124484 0.140659 0.146123 0.160554 0.160344 0.126775 0.121028 0.118890 0.126451 0.133019 0.108796 0.141112
qa: -0.2427 -0.3311 -0.4902 -0.2918 -0.2969 -0.5282 -0.1561 -0.0101 -0.1252 -0.0404 -0.0151 -0.0885 0.1749 0.4270 -0.3177 -0.1266 -0.2628 0.3448 -0.2096 -0.2859 0.1058 -0.1751 0.0611 -0.1308 -0.2198 -0.1177 -0.1730 -0.1569 0.5067 0.1967 -0.1413 -0.1372 0.1058 0.0944 0.0819 0.0760 0.0801 0.0306 0.1257 0.1242 0.1115 0.1560 0.1304 0.1423 0.0928 0.0865 0.0804 0.1270 0.1245 0.1407 0.1461 0.1606 0.1603 0.1268 0.1210 0.1189 0.1265 0.1330 0.1088 0.1411
va: 2.1626 2.0667 2.0178 2.1249 2.0924 1.9732 3.8494 3.3314 3.8493 3.6479 3.5984 3.8783 3.9033 4.2551 3.9452 3.9156 3.9987 3.7219 3.9225 3.9325 3.7488 3.7108 3.3573 3.8877 3.9650 3.4239 3.9063 3.8963 4.1046 3.9399 3.8700 3.8580 1.0037 1.0215 1.0216 1.0106 1.0063 1.0156 0.9874 0.9986 1.0057 0.9943 1.0321 1.0105 1.0040 1.0030 0.9982 0.9910 0.9971 1.0010 1.0081 0.9899 0.9905 1.0236 0.9946 0.9924 0.9955 0.9869 0.9830 0.9917
dispcorr: -0.038460435 hartree
energy: -1459.161664429568
dipole: 23.65360 -24.17350 -0.51991 -1.10193 3.78965 2.68772 -20.12755 16.87435 -3.25320
magnitude: 4.25176 au
magnitude: 10.80712 debye
