program: Orca
programVersion: 5.0.4
elementType: O O O O O O C C C C C C C C C C C C C C C C C C C C C C C C C C H H H H H H H H H H H H H H H H H H H H H H H H H H H H
charge: 0
multiplicity: 1
keywords: wb97x-d3
keywords: def2-TZVPP
keywords: def2/J RIJCOSX
keywords: DEFGRID2
keywords: scfconv7
keywords: smallprint printgap noloewdin
keywords: NOSOSCF
formula: C26H28O6
InChI: InChI=1/C26H28O6/c1-5-6-10-21-17(2)20-13-12-19(14-24(20)32-26(21)28)31-15-18-9-7-8-11-22(18)23(16-29-3)25(27)30-4/h7-9,11-14,16H,5-6,10,15H2,1-4H3
60 atoms
O  2.245362 -1.209176 -1.260448
O  -1.827905 0.697818 -2.413931
O  4.072723 -2.298293 -0.789443
O  -1.088532 -0.6203 1.292873
O  -4.46351 -1.202655 -1.850582
O  -1.256472 -2.605858 0.287437
C  5.132136 -0.34097 0.968186
C  3.825258 -0.180252 0.24713
C  4.958629 -1.024203 2.3262
C  2.995001 0.884814 0.404074
C  1.748882 0.929278 -0.326965
C  6.269903 -1.222787 3.078302
C  1.411063 -0.148045 -1.1441
C  3.429511 -1.287092 -0.604582
C  3.297649 2.018146 1.327591
C  0.833114 1.983779 -0.259003
C  0.220122 -0.213386 -1.84054
C  -0.676887 0.841751 -1.734318
C  -0.358992 1.957107 -0.951604
C  6.963088 0.078128 3.45911
C  -2.920329 1.548545 -2.120055
C  -3.396407 1.544406 -0.686141
C  -3.364379 0.438202 0.173464
C  -3.931712 2.746072 -0.222468
C  -3.865552 0.583933 1.470145
C  -2.835099 -0.890927 -0.215785
C  -4.436349 2.871788 1.059841
C  -4.398747 1.780358 1.915993
C  -1.670299 -1.4746 0.458306
C  -3.398956 -1.627011 -1.18988
C  0.046443 -1.079488 2.025891
C  -4.893658 -2.011503 -2.944326
H  5.822741 -0.924695 0.356686
H  5.603269 0.633294 1.095706
H  4.476944 -1.994466 2.176489
H  4.272001 -0.432331 2.940424
H  6.067182 -1.798122 3.985158
H  6.94563 -1.836322 2.47478
H  4.246294 1.906433 1.843108
H  3.317031 2.966762 0.788692
H  2.517596 2.099957 2.086859
H  1.053219 2.848918 0.351141
H  -0.018982 -1.080557 -2.443359
H  -1.027395 2.802283 -0.871716
H  6.299637 0.722973 4.039203
H  7.288512 0.643486 2.584882
H  7.849506 -0.111757 4.0657
H  -2.687397 2.576641 -2.414598
H  -3.718817 1.21089 -2.782142
H  -3.940895 3.604712 -0.883794
H  -3.847776 -0.268461 2.138023
H  -4.844238 3.817712 1.390841
H  -4.781257 1.859291 2.925098
H  -2.999025 -2.599526 -1.466481
H  0.833231 -1.456767 1.372973
H  0.418015 -0.21665 2.571829
H  -0.232233 -1.858224 2.736827
H  -5.100951 -3.0323 -2.620389
H  -5.807797 -1.564745 -3.324945
H  -4.144488 -2.025441 -3.73651
elementType: O C H
totalener: -1459.12336906 hartree
nucrepener: 3356.72883198 hartree
electener: -4815.85220104 hartree
oneelecener: -8665.25817836 hartree
twoeener: 3849.40597732 hartree
cpcmener: -0.05847963 hartree
kineticenergy: 1452.83463879 hartree
xcener: -140.275573008672 hartree
chargesum: -0.0000000
charge: -0.241532 -0.331283 -0.490377 -0.281626 -0.297959 -0.522473 -0.127567 -0.009937 -0.129956 -0.015645 -0.085006 -0.108501 0.207099 0.423829 -0.276233 -0.106525 -0.281725 0.338013 -0.224526 -0.283151 0.115516 -0.179955 0.075873 -0.124491 -0.232223 -0.123433 -0.177380 -0.151889 0.466327 0.243649 -0.144823 -0.127067 0.088810 0.099792 0.084346 0.078335 0.069182 0.057788 0.096245 0.118985 0.117328 0.156594 0.132857 0.142865 0.081456 0.080909 0.094857 0.122647 0.123190 0.140852 0.143803 0.160460 0.160310 0.109088 0.104489 0.126622 0.140682 0.124055 0.123787 0.124645
qa: -0.2415 -0.3313 -0.4904 -0.2816 -0.2980 -0.5225 -0.1276 -0.0099 -0.1300 -0.0156 -0.0850 -0.1085 0.2071 0.4238 -0.2762 -0.1065 -0.2817 0.3380 -0.2245 -0.2832 0.1155 -0.1800 0.0759 -0.1245 -0.2322 -0.1234 -0.1774 -0.1519 0.4663 0.2436 -0.1448 -0.1271 0.0888 0.0998 0.0843 0.0783 0.0692 0.0578 0.0962 0.1190 0.1173 0.1566 0.1329 0.1429 0.0815 0.0809 0.0949 0.1226 0.1232 0.1409 0.1438 0.1605 0.1603 0.1091 0.1045 0.1266 0.1407 0.1241 0.1238 0.1246
va: 2.1643 2.0605 2.0180 2.0995 2.1251 1.9770 3.8209 3.3604 3.8521 3.7246 3.6317 3.8851 3.8860 4.2683 3.9551 3.8873 3.9903 3.7456 3.9162 3.9279 3.7219 3.7084 3.3540 3.8709 3.9821 3.4537 3.9145 3.8925 4.1285 3.9632 3.8675 3.8502 1.0241 0.9974 1.0190 1.0090 1.0077 1.0083 1.0068 0.9962 0.9932 0.9941 1.0265 1.0114 1.0004 0.9984 1.0048 0.9976 0.9946 1.0011 1.0092 0.9899 0.9903 1.0272 0.9926 0.9930 0.9963 0.9871 0.9936 0.9861
dispcorr: -0.036776638 hartree
energy: -1459.160145696724
dipole: 22.42437 -24.71987 -2.29549 6.26801 -2.78724 3.48077 19.87056 -19.33338 0.53718
magnitude: 4.20400 au
magnitude: 10.68572 debye
