program: Orca
programVersion: 5.0.4
elementType: O O O O O O C C C C C C C C C C C C C C C C C C C C C C C C C C H H H H H H H H H H H H H H H H H H H H H H H H H H H H
charge: 0
multiplicity: 1
keywords: wb97x-d3
keywords: def2-TZVPP
keywords: def2/J RIJCOSX
keywords: DEFGRID2
keywords: scfconv7
keywords: smallprint printgap noloewdin
keywords: NOSOSCF
formula: C26H28O6
InChI: InChI=1/C26H28O6/c1-5-6-10-21-17(2)20-13-12-19(14-24(20)32-26(21)28)31-15-18-9-7-8-11-22(18)23(16-29-3)25(27)30-4/h7-9,11-14,16H,5-6,10,15H2,1-4H3
60 atoms
O  2.029554 1.529027 -1.225165
O  -2.088859 1.698979 1.111761
O  3.848682 1.484765 -2.421667
O  -4.78433 -0.152458 1.12258
O  -0.599655 -1.863172 0.060839
O  -3.557495 -0.997867 2.787333
C  5.510309 0.426055 -0.415721
C  4.050005 0.701716 -0.192116
C  5.840401 -0.840368 -1.215947
C  3.370557 0.476004 0.965016
C  1.960188 0.789838 1.035433
C  5.541711 -2.168856 -0.520711
C  1.33083 1.314183 -0.086559
C  3.350714 1.24841 -1.341133
C  3.994592 -0.12445 2.181643
C  1.161674 0.592982 2.173074
C  -0.017262 1.641732 -0.122106
C  -0.774497 1.433964 1.019397
C  -0.176127 0.904338 2.171852
C  4.089339 -2.62324 -0.583652
C  -2.816907 2.031071 -0.056777
C  -2.893602 0.940537 -1.098357
C  -2.8734 -0.429651 -0.806297
C  -3.033845 1.350705 -2.422165
C  -2.992438 -1.34143 -1.856431
C  -2.692589 -0.961655 0.564603
C  -3.161949 0.434829 -3.453627
C  -3.139321 -0.922339 -3.16854
C  -3.685672 -0.720076 1.610153
C  -1.590341 -1.650974 0.913535
C  -5.823318 0.179484 2.040934
C  0.482455 -2.661743 0.53367
H  5.943546 1.28082 -0.940523
H  6.032759 0.379436 0.539222
H  6.910375 -0.798277 -1.433292
H  5.3396 -0.815642 -2.187491
H  6.159118 -2.940575 -0.98769
H  5.870635 -2.11785 0.521859
H  5.054332 -0.324525 2.06647
H  3.868595 0.530418 3.045556
H  3.504373 -1.06949 2.425811
H  1.596439 0.180359 3.072764
H  -0.430908 2.049797 -1.034379
H  -0.779293 0.734269 3.054329
H  3.97306 -3.618869 -0.152424
H  3.739472 -2.671988 -1.617072
H  3.417738 -1.958094 -0.044543
H  -3.81735 2.278824 0.301236
H  -2.415396 2.942727 -0.510401
H  -3.033096 2.410978 -2.647642
H  -2.982353 -2.401041 -1.633302
H  -3.269313 0.780503 -4.473345
H  -3.233187 -1.652157 -3.96195
H  -1.473621 -2.049134 1.91838
H  -5.482092 0.889935 2.793871
H  -6.608945 0.639619 1.448254
H  -6.221894 -0.707174 2.533856
H  0.966932 -2.201516 1.396763
H  0.142453 -3.663532 0.801432
H  1.195885 -2.734866 -0.2823
elementType: O C H
totalener: -1459.12148569 hartree
nucrepener: 3395.04806243 hartree
electener: -4854.16954812 hartree
oneelecener: -8741.30949202 hartree
twoeener: 3887.13994390 hartree
cpcmener: -0.05623531 hartree
kineticenergy: 1452.84002218 hartree
xcener: -140.278686582491 hartree
chargesum: 0.0000000
charge: -0.238258 -0.327790 -0.493967 -0.289516 -0.297430 -0.526583 -0.160540 -0.023416 -0.122652 0.003928 -0.069289 -0.126561 0.178833 0.434352 -0.277618 -0.185154 -0.179969 0.331792 -0.214418 -0.243694 0.115179 -0.167523 0.052811 -0.137981 -0.210754 -0.121281 -0.170454 -0.159444 0.503910 0.188474 -0.142180 -0.133249 0.095918 0.099713 0.082632 0.068951 0.078704 0.059472 0.103064 0.125908 0.116211 0.154165 0.127390 0.139424 0.099952 0.088304 0.031840 0.128552 0.123125 0.140977 0.146399 0.161212 0.159997 0.127946 0.117965 0.126789 0.122212 0.113722 0.139232 0.130667
qa: -0.2383 -0.3278 -0.4940 -0.2895 -0.2974 -0.5266 -0.1605 -0.0234 -0.1227 0.0039 -0.0693 -0.1266 0.1788 0.4344 -0.2776 -0.1852 -0.1800 0.3318 -0.2144 -0.2437 0.1152 -0.1675 0.0528 -0.1380 -0.2108 -0.1213 -0.1705 -0.1594 0.5039 0.1885 -0.1422 -0.1332 0.0959 0.0997 0.0826 0.0690 0.0787 0.0595 0.1031 0.1259 0.1162 0.1542 0.1274 0.1394 0.1000 0.0883 0.0318 0.1286 0.1231 0.1410 0.1464 0.1612 0.1600 0.1279 0.1180 0.1268 0.1222 0.1137 0.1392 0.1307
va: 2.1841 2.0784 2.0130 2.1258 2.0892 1.9752 3.8763 3.3157 3.8566 3.6437 3.5963 3.9059 4.0314 4.2588 3.9307 3.8486 3.9280 3.7296 3.9298 3.9062 3.7410 3.7068 3.3786 3.8920 3.9620 3.4341 3.9052 3.8991 4.1091 3.9431 3.8701 3.8430 1.0158 1.0033 1.0080 1.0200 1.0025 1.0042 1.0112 0.9973 0.9896 0.9957 1.0313 1.0171 1.0022 1.0032 1.0085 0.9897 0.9979 1.0015 1.0081 0.9895 0.9907 1.0234 0.9927 0.9953 0.9939 0.9796 0.9903 0.9930
dispcorr: -0.038141407 hartree
energy: -1459.159627099189
dipole: 22.29370 -22.51238 -0.21868 -16.21885 15.17785 -1.04099 3.70071 -1.91564 1.78507
magnitude: 2.07797 au
magnitude: 5.28179 debye
