program: Orca
programVersion: 5.0.4
elementType: O O O O O O C C C C C C C C C C C C C C C C C C C C C C C C C C H H H H H H H H H H H H H H H H H H H H H H H H H H H H
charge: 0
multiplicity: 1
keywords: wb97x-d3
keywords: def2-TZVPP
keywords: def2/J RIJCOSX
keywords: DEFGRID2
keywords: scfconv7
keywords: smallprint printgap noloewdin
keywords: NOSOSCF
formula: C26H28O6
InChI: InChI=1/C26H28O6/c1-5-6-10-21-17(2)20-13-12-19(14-24(20)32-26(21)28)31-15-18-9-7-8-11-22(18)23(16-29-3)25(27)30-4/h7-9,11-14,16H,5-6,10,15H2,1-4H3
60 atoms
O  2.306985 -1.15863 -1.265123
O  -1.846077 0.595035 -2.380875
O  4.173316 -2.182003 -0.799158
O  -1.097535 -0.669622 1.235308
O  -4.679851 -1.228879 -1.672113
O  -1.365786 -2.669171 0.279965
C  5.276459 -0.077556 0.753797
C  3.923614 -0.004194 0.106047
C  5.22416 -0.652259 2.169596
C  3.069659 1.044967 0.243162
C  1.787478 1.011196 -0.423032
C  6.597552 -0.699776 2.825122
C  1.448645 -0.114531 -1.171424
C  3.518512 -1.171666 -0.655665
C  3.388734 2.245741 1.070735
C  0.845611 2.043531 -0.371219
C  0.23757 -0.242602 -1.823077
C  -0.681687 0.795725 -1.739938
C  -0.367892 1.953506 -1.019263
C  6.556649 -1.250134 4.242003
C  -2.944585 1.451252 -2.120974
C  -3.394649 1.517956 -0.681064
C  -3.387299 0.433321 0.204859
C  -3.870897 2.751064 -0.237352
C  -3.849503 0.628353 1.508671
C  -2.926717 -0.92457 -0.172146
C  -4.338742 2.92711 1.05356
C  -4.323534 1.856604 1.936177
C  -1.740222 -1.523781 0.446461
C  -3.589417 -1.675144 -1.069893
C  0.062398 -1.143358 1.917417
C  -5.241806 -2.074405 -2.674601
H  5.943909 -0.686343 0.141906
H  5.72934 0.914538 0.783621
H  4.794201 -1.658149 2.140223
H  4.547103 -0.045659 2.779634
H  7.269957 -1.308974 2.213952
H  7.025229 0.307452 2.835965
H  2.653573 2.357459 1.869587
H  4.369541 2.196728 1.532267
H  3.345006 3.155351 0.469623
H  1.063137 2.943352 0.187562
H  0.004002 -1.142456 -2.37807
H  -1.054062 2.785559 -0.956373
H  5.921282 -0.639581 4.886095
H  7.550904 -1.274285 4.689707
H  6.162518 -2.267718 4.261775
H  -2.727726 2.463581 -2.475533
H  -3.747526 1.067189 -2.751289
H  -3.861211 3.593464 -0.919145
H  -3.849056 -0.208399 2.196343
H  -4.700389 3.896289 1.370678
H  -4.677787 1.976362 2.951735
H  -3.24866 -2.672673 -1.335832
H  0.474411 -0.283294 2.437758
H  -0.194269 -1.912414 2.647093
H  0.809721 -1.538536 1.230068
H  -5.512124 -3.046959 -2.261227
H  -6.138179 -1.578217 -3.035953
H  -4.548368 -2.211169 -3.50475
elementType: O C H
totalener: -1459.12485531 hartree
nucrepener: 3331.51672037 hartree
electener: -4790.64157568 hartree
oneelecener: -8614.90633929 hartree
twoeener: 3824.26476361 hartree
cpcmener: -0.05829410 hartree
kineticenergy: 1452.83759419 hartree
xcener: -140.273721125971 hartree
chargesum: -0.0000000
charge: -0.240555 -0.330780 -0.490761 -0.280319 -0.298801 -0.521852 -0.115506 -0.008536 -0.130612 0.001903 -0.063844 -0.090841 0.161384 0.420234 -0.284958 -0.105768 -0.260556 0.317670 -0.215580 -0.278923 0.114687 -0.175303 0.082803 -0.124695 -0.233067 -0.127334 -0.173870 -0.152456 0.460901 0.242191 -0.149467 -0.128770 0.087884 0.096520 0.077240 0.073570 0.059071 0.058976 0.118449 0.099322 0.118406 0.156921 0.132291 0.143749 0.078430 0.090439 0.078519 0.122175 0.124005 0.142380 0.144501 0.160596 0.160634 0.108502 0.127028 0.140000 0.108536 0.124809 0.123690 0.124737
qa: -0.2406 -0.3308 -0.4908 -0.2803 -0.2988 -0.5219 -0.1155 -0.0085 -0.1306 0.0019 -0.0638 -0.0908 0.1614 0.4202 -0.2850 -0.1058 -0.2606 0.3177 -0.2156 -0.2789 0.1147 -0.1753 0.0828 -0.1247 -0.2331 -0.1273 -0.1739 -0.1525 0.4609 0.2422 -0.1495 -0.1288 0.0879 0.0965 0.0772 0.0736 0.0591 0.0590 0.1184 0.0993 0.1184 0.1569 0.1323 0.1437 0.0784 0.0904 0.0785 0.1222 0.1240 0.1424 0.1445 0.1606 0.1606 0.1085 0.1270 0.1400 0.1085 0.1248 0.1237 0.1247
va: 2.1607 2.0617 2.0170 2.0993 2.1235 1.9778 3.8266 3.3758 3.8360 3.7099 3.6256 3.8678 3.9144 4.2609 3.9537 3.8970 3.9785 3.7758 3.9091 3.9468 3.7204 3.7156 3.3429 3.8640 3.9864 3.4587 3.9134 3.8948 4.1280 3.9710 3.8653 3.8515 1.0238 1.0010 1.0167 1.0092 1.0080 1.0076 0.9925 1.0067 0.9960 0.9940 1.0278 1.0122 1.0006 1.0041 1.0008 0.9981 0.9951 1.0008 1.0083 0.9897 0.9901 1.0272 0.9932 0.9963 0.9937 0.9866 0.9938 0.9857
dispcorr: -0.035613687 hartree
energy: -1459.160468993259
dipole: 21.99130 -24.39110 -2.39979 4.89915 -1.34603 3.55312 20.55348 -20.11552 0.43795
magnitude: 4.30993 au
magnitude: 10.95496 debye
