program: Orca
programVersion: 5.0.4
elementType: O O O O O O C C C C C C C C C C C C C C C C C C C C C C C C C C H H H H H H H H H H H H H H H H H H H H H H H H H H H H
charge: 0
multiplicity: 1
keywords: wb97x-d3
keywords: def2-TZVPP
keywords: def2/J RIJCOSX
keywords: DEFGRID2
keywords: scfconv7
keywords: smallprint printgap noloewdin
keywords: NOSOSCF
formula: C26H28O6
InChI: InChI=1/C26H28O6/c1-5-6-10-21-17(2)20-13-12-19(14-24(20)32-26(21)28)31-15-18-9-7-8-11-22(18)23(16-29-3)25(27)30-4/h7-9,11-14,16H,5-6,10,15H2,1-4H3
60 atoms
O  1.91849 -1.200634 1.626198
O  -2.104143 1.122309 1.623584
O  3.714842 -2.42663 1.75859
O  -4.873651 -0.589555 0.919181
O  -0.940816 -1.035399 -1.52124
O  -3.451284 -2.206648 1.509402
C  5.180068 -1.007533 -0.214475
C  3.780884 -0.646841 0.193877
C  6.227467 -0.29187 0.642086
C  3.106157 0.434192 -0.279853
C  1.768828 0.703897 0.19822
C  7.664208 -0.624037 0.254913
C  1.208271 -0.151739 1.14509
C  3.180957 -1.481299 1.218988
C  3.685753 1.373856 -1.285746
C  0.977651 1.770801 -0.237147
C  -0.078991 0.001957 1.621987
C  -0.847681 1.058091 1.148552
C  -0.30867 1.958115 0.223696
C  8.053782 -0.131126 -1.131742
C  -3.030797 2.009639 1.022798
C  -3.315443 1.751069 -0.437178
C  -3.288151 0.482661 -1.033022
C  -3.65532 2.858281 -1.21106
C  -3.597436 0.373738 -2.389895
C  -2.914552 -0.750411 -0.300926
C  -3.970742 2.733914 -2.554186
C  -3.938074 1.481417 -3.149009
C  -3.737122 -1.267036 0.791713
C  -1.794127 -1.43811 -0.592992
C  -5.764198 -0.981147 1.962691
C  0.167785 -1.896215 -1.777422
H  5.324482 -2.086192 -0.131199
H  5.327189 -0.771735 -1.268319
H  6.065051 -0.55433 1.691068
H  6.073824 0.789819 0.56978
H  8.335381 -0.177703 0.993114
H  7.819253 -1.705302 0.319791
H  3.697211 2.391447 -0.892193
H  4.702487 1.120596 -1.569805
H  3.07737 1.390876 -2.191803
H  1.370618 2.473598 -0.958801
H  -0.490941 -0.701889 2.334612
H  -0.873885 2.801573 -0.145186
H  9.11109 -0.310148 -1.330981
H  7.8785 0.942206 -1.2308
H  7.48942 -0.630045 -1.920678
H  -3.942563 1.895087 1.610824
H  -2.704922 3.046483 1.152808
H  -3.660329 3.839685 -0.750975
H  -3.582884 -0.604661 -2.853753
H  -4.229963 3.611191 -3.132092
H  -4.175476 1.365551 -4.1983
H  -1.546829 -2.352529 -0.059571
H  -5.296376 -0.896828 2.943569
H  -6.605175 -0.295442 1.908998
H  -6.125003 -1.999832 1.819564
H  0.682919 -2.171391 -0.855917
H  -0.157592 -2.802377 -2.290636
H  0.852046 -1.348814 -2.419981
elementType: O C H
totalener: -1459.12448255 hartree
nucrepener: 3324.01421806 hartree
electener: -4783.13870061 hartree
oneelecener: -8599.17535609 hartree
twoeener: 3816.03665548 hartree
cpcmener: -0.05618975 hartree
kineticenergy: 1452.83533828 hartree
xcener: -140.275753939264 hartree
chargesum: -0.0000000
charge: -0.242307 -0.330342 -0.490472 -0.291905 -0.297872 -0.527836 -0.124402 -0.023727 -0.131433 -0.009723 -0.048499 -0.106532 0.159824 0.428369 -0.275958 -0.126118 -0.260795 0.344516 -0.212621 -0.283968 0.103746 -0.168041 0.063847 -0.133126 -0.215135 -0.124951 -0.169790 -0.159537 0.506744 0.196219 -0.142099 -0.143082 0.088233 0.100671 0.084456 0.079633 0.069947 0.056818 0.117959 0.094891 0.118847 0.155773 0.131259 0.143522 0.095391 0.081573 0.080171 0.126582 0.123859 0.141013 0.146983 0.161338 0.159783 0.126255 0.117162 0.126264 0.123157 0.114985 0.142522 0.127956
qa: -0.2423 -0.3303 -0.4905 -0.2919 -0.2979 -0.5278 -0.1244 -0.0237 -0.1314 -0.0097 -0.0485 -0.1065 0.1598 0.4284 -0.2760 -0.1261 -0.2608 0.3445 -0.2126 -0.2840 0.1037 -0.1680 0.0638 -0.1331 -0.2151 -0.1250 -0.1698 -0.1595 0.5067 0.1962 -0.1421 -0.1431 0.0882 0.1007 0.0845 0.0796 0.0699 0.0568 0.1180 0.0949 0.1188 0.1558 0.1313 0.1435 0.0954 0.0816 0.0802 0.1266 0.1239 0.1410 0.1470 0.1613 0.1598 0.1263 0.1172 0.1263 0.1232 0.1150 0.1425 0.1280
va: 2.1599 2.0664 2.0178 2.1253 2.0906 1.9750 3.8244 3.3669 3.8522 3.7234 3.6098 3.8814 3.9102 4.2644 3.9574 3.9246 3.9924 3.7263 3.9227 3.9281 3.7475 3.7051 3.3590 3.8844 3.9671 3.4404 3.9050 3.8989 4.1062 3.9429 3.8707 3.8559 1.0251 0.9977 1.0198 1.0081 1.0071 1.0087 0.9932 1.0065 0.9961 0.9951 1.0291 1.0110 1.0048 1.0005 0.9986 0.9915 0.9982 1.0010 1.0074 0.9893 0.9907 1.0246 0.9932 0.9955 0.9932 0.9849 0.9909 0.9900
dispcorr: -0.036115978 hartree
energy: -1459.160598524862
dipole: 32.19701 -32.69154 -0.49453 5.48156 -2.31634 3.16522 -12.43207 9.67445 -2.75762
magnitude: 4.22701 au
magnitude: 10.74422 debye
