program: Orca
programVersion: 5.0.4
elementType: O O O O O O C C C C C C C C C C C C C C C C C C C C C C C C C C H H H H H H H H H H H H H H H H H H H H H H H H H H H H
charge: 0
multiplicity: 1
keywords: wb97x-d3
keywords: def2-TZVPP
keywords: def2/J RIJCOSX
keywords: DEFGRID2
keywords: scfconv7
keywords: smallprint printgap noloewdin
keywords: NOSOSCF
formula: C26H28O6
InChI: InChI=1/C26H28O6/c1-5-6-10-21-17(2)20-13-12-19(14-24(20)32-26(21)28)31-15-18-9-7-8-11-22(18)23(16-29-3)25(27)30-4/h7-9,11-14,16H,5-6,10,15H2,1-4H3
60 atoms
O  1.78582 -1.256118 1.440949
O  -2.154674 1.205566 1.593606
O  3.547635 -2.536917 1.500751
O  -3.421109 -2.014173 1.462773
O  -1.050592 -0.977123 -1.607493
O  -4.942805 -0.460806 0.954686
C  5.022908 -1.09674 -0.442158
C  3.638058 -0.71229 -0.009655
C  6.090636 -0.439838 0.433408
C  2.990104 0.404754 -0.433629
C  1.676944 0.705955 0.089431
C  7.507871 -0.809986 0.022332
C  1.105336 -0.163959 1.016232
C  3.030865 -1.561653 0.999277
C  3.57318 1.355598 -1.426294
C  0.923126 1.823333 -0.279552
C  -0.165855 0.017824 1.525663
C  -0.903668 1.118087 1.106676
C  -0.345239 2.039373 0.215295
C  8.556289 -0.125105 0.885069
C  -3.062574 2.120778 1.003827
C  -3.331182 1.898889 -0.465791
C  -3.315671 0.643341 -1.088541
C  -3.632219 3.028893 -1.22264
C  -3.593487 0.569201 -2.454357
C  -2.99447 -0.608164 -0.365054
C  -3.91678 2.939136 -2.575254
C  -3.892369 1.699601 -3.196913
C  -3.879127 -1.003826 0.728291
C  -1.912329 -1.349452 -0.672035
C  -4.237749 -2.465053 2.541892
C  -0.004373 -1.900123 -1.902863
H  5.136868 -2.181349 -0.405198
H  5.183843 -0.81844 -1.484397
H  5.928078 -0.722093 1.478234
H  5.970415 0.647406 0.387979
H  7.632703 -1.895176 0.081356
H  7.662576 -0.541375 -1.026903
H  2.922698 1.44713 -2.297691
H  3.661448 2.352509 -0.99133
H  4.557486 1.059563 -1.77402
H  1.331694 2.542788 -0.975471
H  -0.590482 -0.699976 2.216601
H  -0.882488 2.921291 -0.101219
H  8.443047 -0.397536 1.936089
H  8.474653 0.961419 0.81768
H  9.567941 -0.397617 0.58239
H  -3.982297 2.007445 1.578653
H  -2.722352 3.148976 1.16097
H  -3.628733 4.000262 -0.741943
H  -3.588356 -0.399239 -2.938358
H  -4.144238 3.833275 -3.140581
H  -4.103566 1.611522 -4.254354
H  -1.697278 -2.281653 -0.157922
H  -5.213184 -2.806879 2.196695
H  -3.706034 -3.300362 2.988492
H  -4.370705 -1.685878 3.292345
H  0.705255 -1.382405 -2.542369
H  0.504977 -2.232105 -0.996992
H  -0.394635 -2.769853 -2.433634
elementType: O C H
totalener: -1459.12505009 hartree
nucrepener: 3327.02092335 hartree
electener: -4786.14597344 hartree
oneelecener: -8605.19933521 hartree
twoeener: 3819.05336178 hartree
cpcmener: -0.05598691 hartree
kineticenergy: 1452.85274486 hartree
xcener: -140.278532428967 hartree
chargesum: -0.0000000
charge: -0.241798 -0.330602 -0.490842 -0.297731 -0.296768 -0.515648 -0.111671 -0.022575 -0.133045 -0.008155 -0.040400 -0.090185 0.149033 0.425401 -0.285160 -0.118115 -0.261243 0.352157 -0.217444 -0.278142 0.097050 -0.168816 0.074006 -0.134083 -0.205565 -0.091358 -0.171697 -0.158365 0.475420 0.161859 -0.132630 -0.143553 0.087701 0.096764 0.077358 0.074355 0.059395 0.059009 0.118783 0.118627 0.100344 0.156637 0.130538 0.142532 0.078505 0.078388 0.090302 0.126565 0.123214 0.141047 0.145630 0.161062 0.159980 0.138472 0.118548 0.125049 0.116219 0.128574 0.114977 0.142087
qa: -0.2418 -0.3306 -0.4908 -0.2977 -0.2968 -0.5156 -0.1117 -0.0226 -0.1330 -0.0082 -0.0404 -0.0902 0.1490 0.4254 -0.2852 -0.1181 -0.2612 0.3522 -0.2174 -0.2781 0.0971 -0.1688 0.0740 -0.1341 -0.2056 -0.0914 -0.1717 -0.1584 0.4754 0.1619 -0.1326 -0.1436 0.0877 0.0968 0.0774 0.0744 0.0594 0.0590 0.1188 0.1186 0.1003 0.1566 0.1305 0.1425 0.0785 0.0784 0.0903 0.1266 0.1232 0.1410 0.1456 0.1611 0.1600 0.1385 0.1185 0.1250 0.1162 0.1286 0.1150 0.1421
va: 2.1600 2.0618 2.0168 2.0871 2.0819 1.9976 3.8330 3.3930 3.8364 3.7010 3.6101 3.8682 3.9226 4.2565 3.9556 3.9184 3.9935 3.7132 3.9298 3.9445 3.7302 3.7028 3.3993 3.8871 3.9549 3.4434 3.9073 3.8994 4.1350 3.9552 3.8696 3.8523 1.0251 1.0022 1.0165 1.0078 1.0085 1.0080 0.9960 0.9923 1.0067 0.9945 1.0311 1.0117 1.0008 1.0007 1.0044 0.9987 0.9984 1.0009 1.0080 0.9894 0.9906 1.0169 0.9944 0.9954 0.9926 0.9900 0.9860 0.9913
dispcorr: -0.035594950 hartree
energy: -1459.160645037312
dipole: 36.27390 -35.32771 0.94619 1.62359 -0.03645 1.58714 -7.37619 5.19489 -2.18129
magnitude: 2.85873 au
magnitude: 7.26631 debye
