program: Orca
programVersion: 5.0.4
elementType: O O O O O O C C C C C C C C C C C C C C C C C C C C C C C C C C H H H H H H H H H H H H H H H H H H H H H H H H H H H H
charge: 0
multiplicity: 1
keywords: wb97x-d3
keywords: def2-TZVPP
keywords: def2/J RIJCOSX
keywords: DEFGRID2
keywords: scfconv7
keywords: smallprint printgap noloewdin
keywords: NOSOSCF
formula: C26H28O6
InChI: InChI=1/C26H28O6/c1-5-6-10-21-17(2)20-13-12-19(14-24(20)32-26(21)28)31-15-18-9-7-8-11-22(18)23(16-29-3)25(27)30-4/h7-9,11-14,16H,5-6,10,15H2,1-4H3
60 atoms
O  1.907026 -1.260447 1.500333
O  -2.105542 1.0736 1.660899
O  3.70546 -2.488353 1.561464
O  -4.824763 -0.629964 0.951106
O  -0.969466 -0.921226 -1.629065
O  -3.368976 -2.255319 1.42559
C  5.111422 -1.043134 -0.434833
C  3.728183 -0.682711 0.024792
C  6.194416 -0.336381 0.381296
C  3.043717 0.410111 -0.406053
C  1.726887 0.679898 0.125415
C  7.600931 -0.678963 -0.088199
C  1.189079 -0.196527 1.066337
C  3.157591 -1.533571 1.053359
C  3.589981 1.361752 -1.418607
C  0.932593 1.765192 -0.254431
C  -0.083441 -0.049394 1.582745
C  -0.859178 1.02232 1.158391
C  -0.338481 1.947931 0.248634
C  8.67602 0.028783 0.721443
C  -3.040478 1.983654 1.10909
C  -3.353093 1.780199 -0.354242
C  -3.317724 0.539766 -1.00538
C  -3.727663 2.913774 -1.072184
C  -3.652831 0.484783 -2.359593
C  -2.907695 -0.718251 -0.338767
C  -4.068958 2.842311 -2.412702
C  -4.027191 1.617864 -3.062746
C  -3.686631 -1.288842 0.758764
C  -1.789297 -1.377895 -0.695786
C  -5.678212 -1.073857 2.004072
C  0.126959 -1.764495 -1.976147
H  5.254295 -2.122796 -0.367829
H  5.23202 -0.795509 -1.490487
H  6.084866 -0.601083 1.437649
H  6.042855 0.746013 0.31914
H  7.750174 -1.76122 -0.030652
H  7.702843 -0.412947 -1.144583
H  3.648732 2.368347 -1.001386
H  4.581589 1.09111 -1.766494
H  2.932269 1.416883 -2.287771
H  1.310373 2.486017 -0.966292
H  -0.480415 -0.772044 2.285076
H  -0.907451 2.805688 -0.079168
H  9.675843 -0.217584 0.362001
H  8.627505 -0.251516 1.775307
H  8.565173 1.113284 0.664916
H  -3.94202 1.850411 1.708724
H  -2.708675 3.014022 1.270875
H  -3.739654 3.874041 -0.569498
H  -3.630979 -0.472187 -2.865796
H  -4.355246 3.739023 -2.946381
H  -4.283675 1.54323 -4.111252
H  -1.515831 -2.313158 -0.213651
H  -5.182807 -1.020364 2.973492
H  -6.529113 -0.398545 2.001917
H  -6.029933 -2.091026 1.831884
H  0.795167 -1.1761 -2.59899
H  0.667103 -2.104413 -1.091227
H  -0.21766 -2.631949 -2.540923
elementType: O C H
totalener: -1459.12528372 hartree
nucrepener: 3321.57476118 hartree
electener: -4780.70004490 hartree
oneelecener: -8594.32126580 hartree
twoeener: 3813.62122089 hartree
cpcmener: -0.05641375 hartree
kineticenergy: 1452.84716641 hartree
xcener: -140.277344058776 hartree
chargesum: 0.0000000
charge: -0.242231 -0.330777 -0.490948 -0.291436 -0.298185 -0.528205 -0.110227 -0.026551 -0.132842 -0.004041 -0.061890 -0.090166 0.177585 0.426508 -0.283542 -0.122282 -0.268970 0.351715 -0.215401 -0.278620 0.104907 -0.170372 0.063715 -0.132627 -0.216374 -0.123690 -0.170930 -0.159443 0.506460 0.197525 -0.142789 -0.139583 0.087504 0.096898 0.077139 0.074566 0.059192 0.059410 0.119201 0.099553 0.118143 0.155311 0.129947 0.143516 0.090428 0.078712 0.078187 0.125948 0.124627 0.140441 0.146931 0.161345 0.160056 0.127092 0.117651 0.126203 0.123166 0.126482 0.113616 0.142444
qa: -0.2422 -0.3308 -0.4909 -0.2914 -0.2982 -0.5282 -0.1102 -0.0266 -0.1328 -0.0040 -0.0619 -0.0902 0.1776 0.4265 -0.2835 -0.1223 -0.2690 0.3517 -0.2154 -0.2786 0.1049 -0.1704 0.0637 -0.1326 -0.2164 -0.1237 -0.1709 -0.1594 0.5065 0.1975 -0.1428 -0.1396 0.0875 0.0969 0.0771 0.0746 0.0592 0.0594 0.1192 0.0996 0.1181 0.1553 0.1299 0.1435 0.0904 0.0787 0.0782 0.1259 0.1246 0.1404 0.1469 0.1613 0.1601 0.1271 0.1177 0.1262 0.1232 0.1265 0.1136 0.1424
va: 2.1617 2.0660 2.0165 2.1256 2.0921 1.9743 3.8302 3.3957 3.8373 3.7013 3.6088 3.8674 3.8982 4.2590 3.9558 3.9164 3.9999 3.7104 3.9241 3.9454 3.7490 3.7035 3.3607 3.8860 3.9665 3.4410 3.9054 3.8991 4.1056 3.9378 3.8709 3.8571 1.0252 1.0015 1.0165 1.0083 1.0083 1.0078 0.9923 1.0066 0.9962 0.9947 1.0307 1.0107 1.0043 1.0008 1.0007 0.9917 0.9979 1.0012 1.0076 0.9893 0.9906 1.0243 0.9929 0.9955 0.9932 0.9899 0.9854 0.9913
dispcorr: -0.035832658 hartree
energy: -1459.161116378682
dipole: 33.09358 -33.68637 -0.59278 5.96216 -2.71920 3.24295 -9.39251 6.66330 -2.72922
magnitude: 4.27981 au
magnitude: 10.87840 debye
