program: Orca
programVersion: 5.0.4
elementType: O O O O O O C C C C C C C C C C C C C C C C C C C C C C C C C C H H H H H H H H H H H H H H H H H H H H H H H H H H H H
charge: 0
multiplicity: 1
keywords: wb97x-d3
keywords: def2-TZVPP
keywords: def2/J RIJCOSX
keywords: DEFGRID2
keywords: scfconv7
keywords: smallprint printgap noloewdin
keywords: NOSOSCF
formula: C26H28O6
InChI: InChI=1/C26H28O6/c1-5-6-10-21-17(2)20-13-12-19(14-24(20)32-26(21)28)31-15-18-9-7-8-11-22(18)23(16-29-3)25(27)30-4/h7-9,11-14,16H,5-6,10,15H2,1-4H3
60 atoms
O  1.809103 -0.476913 2.082003
O  -2.300775 1.553792 1.35313
O  3.58267 -1.692825 2.431464
O  -3.150732 -1.832251 1.773772
O  -0.677087 -0.998391 -1.286027
O  -4.796779 -0.593482 0.908684
C  5.215749 -0.378673 0.518849
C  3.788544 0.004282 0.787006
C  5.332498 -1.410832 -0.603345
C  3.111946 0.956996 0.091772
C  1.718144 1.200244 0.388879
C  6.773864 -1.806784 -0.890916
C  1.107395 0.458562 1.398278
C  3.099961 -0.778412 1.798176
C  3.737858 1.761218 -1.000014
C  0.91735 2.123505 -0.289938
C  -0.225892 0.601178 1.727638
C  -0.999692 1.509297 1.015519
C  -0.420583 2.284241 0.006063
C  6.886653 -2.816905 -2.021835
C  -3.219611 2.226267 0.511045
C  -3.351104 1.668075 -0.886465
C  -3.165149 0.321342 -1.223059
C  -3.729907 2.569525 -1.879464
C  -3.363656 -0.073068 -2.547925
C  -2.743432 -0.707272 -0.24356
C  -3.935518 2.161896 -3.187916
C  -3.749529 0.829619 -3.52516
C  -3.661969 -1.025144 0.846566
C  -1.549239 -1.322489 -0.341791
C  -4.013174 -2.255354 2.828774
C  0.508557 -1.787123 -1.352075
H  5.800928 0.505498 0.261231
H  5.669183 -0.77864 1.426967
H  4.876491 -1.006128 -1.512752
H  4.752987 -2.301557 -0.340627
H  7.3514 -0.911504 -1.139732
H  7.225613 -2.218296 0.016577
H  3.641136 2.828972 -0.797144
H  4.791552 1.542556 -1.14001
H  3.231239 1.571997 -1.948036
H  1.345192 2.728388 -1.077359
H  -0.669689 -0.011579 2.502498
H  -0.995164 3.008547 -0.553318
H  6.34594 -3.735924 -1.787998
H  7.924958 -3.087774 -2.216354
H  6.471541 -2.418948 -2.949683
H  -4.175698 2.150153 1.031656
H  -2.97899 3.292664 0.456625
H  -3.859003 3.613848 -1.620065
H  -3.226457 -1.114678 -2.809916
H  -4.231628 2.882129 -3.939581
H  -3.901505 0.493326 -4.542879
H  -1.246668 -2.099594 0.354374
H  -3.418918 -2.918861 3.450922
H  -4.354382 -1.413662 3.431337
H  -4.875619 -2.801688 2.44786
H  1.189939 -1.281068 -2.031321
H  0.983215 -1.881604 -0.373859
H  0.289205 -2.782406 -1.741352
elementType: O C H
totalener: -1459.12529371 hartree
nucrepener: 3341.64099144 hartree
electener: -4800.76628515 hartree
oneelecener: -8634.30647888 hartree
twoeener: 3833.54019373 hartree
cpcmener: -0.05643804 hartree
kineticenergy: 1452.82559443 hartree
xcener: -140.272799363435 hartree
chargesum: 0.0000000
charge: -0.241113 -0.330077 -0.490680 -0.298828 -0.296252 -0.516546 -0.113000 -0.013289 -0.130742 -0.010848 -0.049275 -0.091398 0.160356 0.418796 -0.287329 -0.119361 -0.264394 0.353321 -0.213607 -0.278989 0.097783 -0.172625 0.078750 -0.131584 -0.209965 -0.089810 -0.173145 -0.157181 0.474074 0.160071 -0.133644 -0.138341 0.097318 0.087507 0.073304 0.077002 0.059209 0.059365 0.119197 0.101265 0.119092 0.157159 0.130238 0.141738 0.078882 0.090705 0.078415 0.126589 0.124203 0.140767 0.145487 0.160575 0.160554 0.139063 0.124569 0.115771 0.120720 0.127446 0.111370 0.141356
qa: -0.2411 -0.3301 -0.4907 -0.2988 -0.2963 -0.5165 -0.1130 -0.0133 -0.1307 -0.0108 -0.0493 -0.0914 0.1604 0.4188 -0.2873 -0.1194 -0.2644 0.3533 -0.2136 -0.2790 0.0978 -0.1726 0.0788 -0.1316 -0.2100 -0.0898 -0.1731 -0.1572 0.4741 0.1601 -0.1336 -0.1383 0.0973 0.0875 0.0733 0.0770 0.0592 0.0594 0.1192 0.1013 0.1191 0.1572 0.1302 0.1417 0.0789 0.0907 0.0784 0.1266 0.1242 0.1408 0.1455 0.1606 0.1606 0.1391 0.1246 0.1158 0.1207 0.1274 0.1114 0.1414
va: 2.1623 2.0655 2.0168 2.0875 2.0832 1.9961 3.8256 3.3856 3.8414 3.7070 3.6207 3.8704 3.9118 4.2586 3.9533 3.9104 4.0046 3.7102 3.9279 3.9453 3.7408 3.7136 3.3857 3.8888 3.9582 3.4259 3.9062 3.8972 4.1403 3.9580 3.8692 3.8540 1.0015 1.0255 1.0086 1.0156 1.0079 1.0082 0.9963 1.0062 0.9920 0.9937 1.0330 1.0111 1.0007 1.0042 1.0007 0.9968 0.9976 1.0008 1.0077 0.9898 0.9903 1.0156 0.9956 0.9926 0.9937 0.9907 0.9860 0.9918
dispcorr: -0.035851480 hartree
energy: -1459.161145186380
dipole: 32.10279 -30.94534 1.15746 -7.88262 9.24009 1.35747 -16.09156 13.68968 -2.40188
magnitude: 2.99190 au
magnitude: 7.60480 debye
