program: Orca
programVersion: 5.0.4
elementType: O O O O O O C C C C C C C C C C C C C C C C C C C C C C C C C C H H H H H H H H H H H H H H H H H H H H H H H H H H H H
charge: 0
multiplicity: 1
keywords: wb97x-d3
keywords: def2-TZVPP
keywords: def2/J RIJCOSX
keywords: DEFGRID2
keywords: scfconv7
keywords: smallprint printgap noloewdin
keywords: NOSOSCF
formula: C26H28O6
InChI: InChI=1/C26H28O6/c1-5-6-10-21-17(2)20-13-12-19(14-24(20)32-26(21)28)31-15-18-9-7-8-11-22(18)23(16-29-3)25(27)30-4/h7-9,11-14,16H,5-6,10,15H2,1-4H3
60 atoms
O  1.971078 -0.066494 1.905917
O  -2.275853 1.839797 1.037335
O  3.786629 -1.21888 2.246467
O  -3.508718 1.55939 -2.231904
O  -0.429846 -0.867883 -1.321942
O  -4.817814 0.64107 -0.672622
C  5.282817 -0.003436 0.137024
C  3.869193 0.37312 0.485602
C  5.377861 -0.922976 -1.084584
C  3.146477 1.302657 -0.196303
C  1.762682 1.528397 0.152412
C  4.62564 -2.240822 -0.953745
C  1.211248 0.802845 1.200271
C  3.254073 -0.358447 1.577346
C  3.711022 2.087393 -1.334626
C  0.904181 2.398394 -0.53726
C  -0.122319 0.895648 1.57212
C  -0.951154 1.728376 0.838385
C  -0.425751 2.497732 -0.210173
C  4.78418 -3.109773 -2.192179
C  -2.924189 0.956852 1.935116
C  -2.84564 -0.512093 1.588443
C  -2.733303 -1.020386 0.288397
C  -2.926074 -1.400482 2.65916
C  -2.704029 -2.404454 0.108161
C  -2.611837 -0.156351 -0.908732
C  -2.906563 -2.771553 2.464985
C  -2.792375 -3.278254 1.1788
C  -3.746156 0.700815 -1.243178
C  -1.489885 -0.144292 -1.654232
C  -4.578312 2.414437 -2.632817
C  0.6582 -0.860397 -2.241604
H  5.869882 0.897147 -0.051123
H  5.754907 -0.489889 0.99072
H  6.435487 -1.13093 -1.272225
H  5.011391 -0.391425 -1.968453
H  4.98174 -2.784965 -0.074409
H  3.561113 -2.04812 -0.787086
H  3.5479 3.155693 -1.186218
H  4.77596 1.929448 -1.471978
H  3.21125 1.816468 -2.266966
H  1.282277 2.986957 -1.361732
H  -0.47593 0.29632 2.399821
H  -1.081735 3.148658 -0.773298
H  4.239223 -4.049545 -2.096264
H  5.832374 -3.354567 -2.374128
H  4.407985 -2.600463 -3.081729
H  -2.546086 1.108118 2.951276
H  -3.96517 1.28257 1.938108
H  -2.99527 -1.005703 3.666215
H  -2.622445 -2.798948 -0.896911
H  -2.96976 -3.438901 3.314406
H  -2.769587 -4.346608 1.009275
H  -1.40195 0.464074 -2.549807
H  -5.429246 1.846181 -3.007688
H  -4.90377 3.058251 -1.815955
H  -4.181126 3.031262 -3.433909
H  0.961443 0.156993 -2.493459
H  1.487354 -1.36967 -1.756074
H  0.396685 -1.395614 -3.155785
elementType: O C H
totalener: -1459.12373143 hartree
nucrepener: 3407.83530559 hartree
electener: -4866.95903702 hartree
oneelecener: -8766.89565022 hartree
twoeener: 3899.93661320 hartree
cpcmener: -0.05970319 hartree
kineticenergy: 1452.83763144 hartree
xcener: -140.277828486884 hartree
chargesum: 0.0000000
charge: -0.239586 -0.330164 -0.491779 -0.299774 -0.297521 -0.514987 -0.125738 -0.055364 -0.138063 0.021121 -0.102140 -0.093832 0.210244 0.433341 -0.288793 -0.133454 -0.207709 0.370648 -0.264823 -0.285569 0.095816 -0.169965 0.084724 -0.132658 -0.212448 -0.098611 -0.174117 -0.155912 0.476710 0.161004 -0.132348 -0.133154 0.100337 0.090569 0.078310 0.072889 0.069471 0.055710 0.118123 0.101573 0.122218 0.155836 0.131083 0.136674 0.091394 0.082810 0.078984 0.125146 0.126566 0.141296 0.144880 0.160947 0.160171 0.138924 0.120457 0.114988 0.125486 0.112877 0.124274 0.142910
qa: -0.2396 -0.3302 -0.4918 -0.2998 -0.2975 -0.5150 -0.1257 -0.0554 -0.1381 0.0211 -0.1021 -0.0938 0.2102 0.4333 -0.2888 -0.1335 -0.2077 0.3706 -0.2648 -0.2856 0.0958 -0.1700 0.0847 -0.1327 -0.2124 -0.0986 -0.1741 -0.1559 0.4767 0.1610 -0.1323 -0.1332 0.1003 0.0906 0.0783 0.0729 0.0695 0.0557 0.1181 0.1016 0.1222 0.1558 0.1311 0.1367 0.0914 0.0828 0.0790 0.1251 0.1266 0.1413 0.1449 0.1609 0.1602 0.1389 0.1205 0.1150 0.1255 0.1129 0.1243 0.1429
va: 2.1853 2.0711 2.0121 2.0865 2.0876 1.9982 3.8565 3.3858 3.8676 3.6603 3.6182 3.8487 3.9641 4.2443 3.9461 3.8261 3.9313 3.6531 3.9953 3.9513 3.7433 3.7088 3.3831 3.8884 3.9626 3.4409 3.9071 3.8975 4.1360 3.9393 3.8682 3.8545 1.0025 1.0268 1.0127 1.0028 1.0143 1.0021 0.9970 1.0071 0.9904 0.9927 1.0306 1.0187 1.0030 1.0012 1.0005 0.9986 0.9965 1.0004 1.0083 0.9895 0.9905 1.0170 0.9939 0.9935 0.9951 0.9833 0.9885 0.9921
dispcorr: -0.037685361 hartree
energy: -1459.161416793112
dipole: 24.68860 -23.80991 0.87870 -5.99705 8.01155 2.01450 -20.59387 17.29049 -3.30338
magnitude: 3.96770 au
magnitude: 10.08509 debye
