program: Orca
programVersion: 5.0.4
elementType: O O O O O O C C C C C C C C C C C C C C C C C C C C C C C C C C H H H H H H H H H H H H H H H H H H H H H H H H H H H H
charge: 0
multiplicity: 1
keywords: wb97x-d3
keywords: def2-TZVPP
keywords: def2/J RIJCOSX
keywords: DEFGRID2
keywords: scfconv7
keywords: smallprint printgap noloewdin
keywords: NOSOSCF
formula: C26H28O6
InChI: InChI=1/C26H28O6/c1-5-6-10-21-17(2)20-13-12-19(14-24(20)32-26(21)28)31-15-18-9-7-8-11-22(18)23(16-29-3)25(27)30-4/h7-9,11-14,16H,5-6,10,15H2,1-4H3
60 atoms
O  1.946842 0.614976 -1.203048
O  -1.904159 -2.144199 -1.128565
O  3.637098 1.984485 -1.327605
O  -1.410828 0.885161 1.393346
O  -5.053339 -1.490773 -0.248669
O  -2.473594 -0.499183 2.785315
C  4.892811 1.10441 1.059237
C  3.584813 0.556585 0.565696
C  6.078381 0.286629 0.541678
C  2.899069 -0.448318 1.174592
C  1.668835 -0.928799 0.588778
C  7.431833 0.791112 1.028992
C  1.229772 -0.364504 -0.602784
C  3.099323 1.107264 -0.685266
C  3.362146 -1.097103 2.436772
C  0.86491 -1.933152 1.148851
C  0.057351 -0.744805 -1.238671
C  -0.727822 -1.71826 -0.6408
C  -0.312909 -2.318272 0.556996
C  7.802368 2.170546 0.504242
C  -2.518453 -1.44107 -2.192055
C  -2.822458 0.017309 -1.936779
C  -3.166677 0.564297 -0.694275
C  -2.776515 0.850991 -3.053907
C  -3.442166 1.932258 -0.617953
C  -3.267461 -0.230529 0.552916
C  -3.065899 2.201253 -2.966263
C  -3.397645 2.747959 -1.734774
C  -2.372917 0.017938 1.688549
C  -4.189222 -1.197479 0.709218
C  -0.483902 1.223263 2.42382
C  -5.892743 -2.620828 -0.015826
H  4.991073 2.144817 0.748749
H  4.911097 1.117893 2.15035
H  6.064041 0.280252 -0.552947
H  5.948781 -0.75319 0.855462
H  7.443789 0.796979 2.12323
H  8.198936 0.075681 0.722067
H  2.604644 -1.005043 3.21744
H  3.524025 -2.164396 2.277017
H  4.286896 -0.676431 2.818309
H  1.161405 -2.407933 2.073827
H  -0.211106 -0.26527 -2.169939
H  -0.929502 -3.082655 1.010987
H  8.804931 2.456677 0.8242
H  7.11832 2.943094 0.857571
H  7.787881 2.192461 -0.587329
H  -1.909213 -1.523529 -3.097886
H  -3.441338 -1.988669 -2.387908
H  -2.494826 0.428485 -4.011343
H  -3.71148 2.359794 0.340011
H  -3.021087 2.822912 -3.850591
H  -3.619294 3.803097 -1.643778
H  -4.256009 -1.772361 1.629504
H  0.014127 0.343754 2.829852
H  0.255031 1.870046 1.959771
H  -0.973935 1.765706 3.232851
H  -6.56863 -2.690413 -0.863475
H  -5.304423 -3.536412 0.049922
H  -6.475235 -2.49521 0.897912
elementType: O C H
totalener: -1459.12348372 hartree
nucrepener: 3339.42835545 hartree
electener: -4798.55183917 hartree
oneelecener: -8630.79619114 hartree
twoeener: 3832.24435197 hartree
cpcmener: -0.05597745 hartree
kineticenergy: 1452.83930355 hartree
xcener: -140.275812983702 hartree
chargesum: -0.0000000
charge: -0.240231 -0.329652 -0.493586 -0.281055 -0.298175 -0.522001 -0.124351 -0.034485 -0.132426 0.028546 -0.123720 -0.108840 0.216253 0.418623 -0.285807 -0.127453 -0.216711 0.340331 -0.253567 -0.279156 0.119162 -0.177800 0.079406 -0.125759 -0.230428 -0.137137 -0.176269 -0.151758 0.470213 0.240953 -0.146620 -0.127869 0.089652 0.097811 0.081804 0.086539 0.057337 0.069028 0.116606 0.120603 0.099963 0.155547 0.130929 0.140733 0.091240 0.080374 0.081016 0.123676 0.124144 0.141188 0.143881 0.161075 0.160175 0.109399 0.110616 0.125194 0.140342 0.123875 0.124624 0.123998
qa: -0.2402 -0.3297 -0.4936 -0.2811 -0.2982 -0.5220 -0.1244 -0.0345 -0.1324 0.0285 -0.1237 -0.1088 0.2163 0.4186 -0.2858 -0.1275 -0.2167 0.3403 -0.2536 -0.2792 0.1192 -0.1778 0.0794 -0.1258 -0.2304 -0.1371 -0.1763 -0.1518 0.4702 0.2410 -0.1466 -0.1279 0.0897 0.0978 0.0818 0.0865 0.0573 0.0690 0.1166 0.1206 0.1000 0.1555 0.1309 0.1407 0.0912 0.0804 0.0810 0.1237 0.1241 0.1412 0.1439 0.1611 0.1602 0.1094 0.1106 0.1252 0.1403 0.1239 0.1246 0.1240
va: 2.1836 2.0710 2.0136 2.0993 2.1242 1.9768 3.8234 3.4138 3.8492 3.6856 3.6084 3.8857 3.9628 4.2779 3.9530 3.8256 3.9228 3.7173 3.9680 3.9304 3.7200 3.7080 3.3500 3.8701 3.9858 3.4645 3.9122 3.8936 4.1142 3.9691 3.8625 3.8512 1.0232 1.0008 1.0132 1.0121 1.0084 1.0069 0.9952 0.9917 1.0072 0.9937 1.0312 1.0128 1.0044 0.9983 1.0004 0.9983 0.9938 1.0011 1.0088 0.9896 0.9903 1.0270 0.9908 0.9936 0.9964 0.9939 0.9859 0.9870
dispcorr: -0.035934803 hartree
energy: -1459.159418525432
dipole: 28.20668 -29.82274 -1.61606 1.14697 -3.47227 -2.32530 10.80564 -9.89763 0.90801
magnitude: 2.97375 au
magnitude: 7.55866 debye
