program: Orca
programVersion: 5.0.4
elementType: O O O O O O C C C C C C C C C C C C C C C C C C C C C C C C C C H H H H H H H H H H H H H H H H H H H H H H H H H H H H
charge: 0
multiplicity: 1
keywords: wb97x-d3
keywords: def2-TZVPP
keywords: def2/J RIJCOSX
keywords: DEFGRID2
keywords: scfconv7
keywords: smallprint printgap noloewdin
keywords: NOSOSCF
formula: C26H28O6
InChI: InChI=1/C26H28O6/c1-5-6-10-21-17(2)20-13-12-19(14-24(20)32-26(21)28)31-15-18-9-7-8-11-22(18)23(16-29-3)25(27)30-4/h7-9,11-14,16H,5-6,10,15H2,1-4H3
60 atoms
O  1.851938 1.269034 -0.68073
O  -1.837974 -1.259279 -2.241298
O  3.436943 2.570489 0.054717
O  -1.273121 0.064566 1.561568
O  -4.772768 -1.5559 -1.023401
O  -2.087991 -1.954124 2.0594
C  4.740369 0.587344 1.607429
C  3.48605 0.327104 0.82382
C  5.996037 0.310647 0.777833
C  2.879348 -0.886488 0.731286
C  1.68717 -1.027388 -0.072975
C  7.296883 0.526144 1.542662
C  1.203936 0.082625 -0.754922
C  2.962433 1.454406 0.075473
C  3.386426 -2.101769 1.435533
C  0.950904 -2.215827 -0.190882
C  0.048465 0.059646 -1.522581
C  -0.67379 -1.121236 -1.585083
C  -0.208695 -2.267294 -0.924512
C  7.53497 1.968073 1.967207
C  -2.517415 -0.111327 -2.709686
C  -2.911693 0.916979 -1.67267
C  -3.178336 0.661543 -0.321593
C  -3.054381 2.219125 -2.154464
C  -3.575361 1.724482 0.49559
C  -3.079547 -0.677793 0.306019
C  -3.462534 3.257813 -1.336844
C  -3.723234 3.008455 0.003264
C  -2.12521 -0.940166 1.388422
C  -3.869381 -1.699136 -0.067814
C  -0.303272 -0.057538 2.600526
C  -5.464487 -2.736077 -1.424456
H  4.7416 1.620219 1.957079
H  4.758439 -0.02852 2.508017
H  5.987569 0.94343 -0.115463
H  5.95737 -0.722349 0.420583
H  7.311809 -0.123955 2.422779
H  8.127164 0.198975 0.911543
H  4.292515 -1.918787 2.003933
H  2.631839 -2.490392 2.122228
H  3.599856 -2.895457 0.717597
H  1.284534 -3.109302 0.31847
H  -0.263971 0.963181 -2.028053
H  -0.779409 -3.184752 -0.985521
H  6.783855 2.318269 2.676374
H  7.514146 2.641167 1.107608
H  8.507959 2.080555 2.447336
H  -1.927172 0.380692 -3.489747
H  -3.411827 -0.500817 -3.198491
H  -2.832984 2.419406 -3.19653
H  -3.787858 1.529389 1.539646
H  -3.567391 4.255823 -1.741567
H  -4.039736 3.807515 0.660457
H  -3.793797 -2.676509 0.402491
H  -0.77695 -0.053978 3.583006
H  0.298844 -0.959424 2.494869
H  0.340427 0.813724 2.512887
H  -4.786011 -3.440055 -1.907558
H  -5.945016 -3.219971 -0.57305
H  -6.225786 -2.428257 -2.135811
elementType: O C H
totalener: -1459.12274218 hartree
nucrepener: 3358.80887929 hartree
electener: -4817.93162147 hartree
oneelecener: -8669.50832763 hartree
twoeener: 3851.57670617 hartree
cpcmener: -0.05581475 hartree
kineticenergy: 1452.83795687 hartree
xcener: -140.276641413361 hartree
chargesum: 0.0000000
charge: -0.240943 -0.331953 -0.494136 -0.281772 -0.297865 -0.522815 -0.125084 -0.031911 -0.132007 0.018708 -0.141843 -0.110392 0.228374 0.418627 -0.282101 -0.092314 -0.232239 0.372497 -0.285064 -0.280536 0.110471 -0.173504 0.065087 -0.124684 -0.228905 -0.127438 -0.179701 -0.153602 0.480000 0.241680 -0.151151 -0.126169 0.089658 0.098512 0.082037 0.085558 0.058185 0.069307 0.100083 0.116664 0.119802 0.154520 0.128916 0.139360 0.080860 0.081315 0.092051 0.125808 0.125657 0.139492 0.143168 0.160609 0.160810 0.110290 0.142305 0.109619 0.127818 0.124080 0.122931 0.123271
qa: -0.2409 -0.3320 -0.4941 -0.2818 -0.2979 -0.5228 -0.1251 -0.0319 -0.1320 0.0187 -0.1418 -0.1104 0.2284 0.4186 -0.2821 -0.0923 -0.2322 0.3725 -0.2851 -0.2805 0.1105 -0.1735 0.0651 -0.1247 -0.2289 -0.1274 -0.1797 -0.1536 0.4800 0.2417 -0.1512 -0.1262 0.0897 0.0985 0.0820 0.0856 0.0582 0.0693 0.1001 0.1167 0.1198 0.1545 0.1289 0.1394 0.0809 0.0813 0.0921 0.1258 0.1257 0.1395 0.1432 0.1606 0.1608 0.1103 0.1423 0.1096 0.1278 0.1241 0.1229 0.1233
va: 2.1813 2.0663 2.0128 2.1007 2.1248 1.9755 3.8238 3.3985 3.8473 3.6769 3.6141 3.8845 3.9334 4.2757 3.9511 3.8196 3.9457 3.6617 3.9940 3.9301 3.7316 3.6893 3.3654 3.8799 3.9822 3.4407 3.9145 3.8931 4.1065 3.9646 3.8653 3.8514 1.0225 1.0004 1.0138 1.0122 1.0084 1.0070 1.0076 0.9948 0.9920 0.9930 1.0301 1.0126 0.9981 1.0004 1.0042 0.9973 0.9929 1.0012 1.0089 0.9900 0.9903 1.0264 0.9962 0.9896 0.9937 0.9865 0.9872 0.9939
dispcorr: -0.036631216 hartree
energy: -1459.159373394314
dipole: 27.85449 -29.34394 -1.48945 -3.40886 0.80893 -2.59993 11.00198 -11.56040 -0.55842
magnitude: 3.04794 au
magnitude: 7.74724 debye
