program: Orca
programVersion: 5.0.4
elementType: O O O O O O C C C C C C C C C C C C C C C C C C C C C C C C C C H H H H H H H H H H H H H H H H H H H H H H H H H H H H
charge: 0
multiplicity: 1
keywords: wb97x-d3
keywords: def2-TZVPP
keywords: def2/J RIJCOSX
keywords: DEFGRID2
keywords: scfconv7
keywords: smallprint printgap noloewdin
keywords: NOSOSCF
formula: C26H28O6
InChI: InChI=1/C26H28O6/c1-5-6-10-21-17(2)20-13-12-19(14-24(20)32-26(21)28)31-15-18-9-7-8-11-22(18)23(16-29-3)25(27)30-4/h7-9,11-14,16H,5-6,10,15H2,1-4H3
60 atoms
O  1.740067 1.509427 -0.043076
O  -1.814089 -0.289356 -2.606802
O  3.243585 2.443821 1.227511
O  -1.227502 -0.586309 1.440564
O  -4.621824 -1.277411 -1.656421
O  -1.89084 -2.68284 1.063196
C  4.661417 0.056718 1.796853
C  3.433074 0.097654 0.934748
C  5.936063 0.276621 0.980009
C  2.911343 -0.981154 0.291581
C  1.724812 -0.822821 -0.517467
C  7.213611 0.200544 1.807918
C  1.166313 0.442278 -0.647108
C  2.839486 1.407328 0.74395
C  3.506503 -2.347161 0.385683
C  1.059955 -1.87941 -1.157834
C  0.005662 0.691873 -1.364938
C  -0.646819 -0.382035 -1.948758
C  -0.104299 -1.671493 -1.85502
C  7.334872 1.293104 2.860225
C  -2.550895 0.915505 -2.555576
C  -2.988217 1.392512 -1.187856
C  -3.206885 0.588402 -0.062125
C  -3.223543 2.765132 -1.092882
C  -3.655282 1.194135 1.116231
C  -2.998925 -0.87882 -0.035074
C  -3.677436 3.347792 0.076291
C  -3.895087 2.553796 1.193819
C  -2.011263 -1.489163 0.862117
C  -3.701626 -1.718182 -0.815303
C  -0.232827 -1.056287 2.34962
C  -5.187346 -2.249257 -2.534052
H  4.580212 0.814283 2.577103
H  4.725159 -0.898936 2.319699
H  5.882224 1.247877 0.478157
H  5.976413 -0.47606 0.187303
H  7.275951 -0.781089 2.28761
H  8.069312 0.260406 1.130635
H  4.402578 -2.380628 0.997113
H  2.787144 -3.053307 0.804764
H  3.769097 -2.715255 -0.607568
H  1.453496 -2.884051 -1.089295
H  -0.366821 1.70554 -1.422147
H  -0.622246 -2.500789 -2.318915
H  7.259744 2.284807 2.409385
H  8.295115 1.238293 3.37469
H  6.557568 1.219498 3.62208
H  -1.989946 1.717936 -3.046101
H  -3.429223 0.728826 -3.175364
H  -3.037581 3.389597 -1.959144
H  -3.83218 0.574349 1.986686
H  -3.851692 4.414956 0.116686
H  -4.247801 2.989893 2.118952
H  -3.535367 -2.792018 -0.781615
H  -0.687227 -1.496981 3.237473
H  0.432569 -1.784593 1.887462
H  0.341883 -0.181582 2.642316
H  -5.987241 -1.755434 -3.07862
H  -4.442087 -2.613084 -3.242049
H  -5.600176 -3.090354 -1.97514
elementType: O C H
totalener: -1459.12250308 hartree
nucrepener: 3366.29875020 hartree
electener: -4825.42125328 hartree
oneelecener: -8684.46844473 hartree
twoeener: 3859.04719144 hartree
cpcmener: -0.05550517 hartree
kineticenergy: 1452.84749429 hartree
xcener: -140.278836787966 hartree
chargesum: -0.0000000
charge: -0.241489 -0.332102 -0.494610 -0.282580 -0.297395 -0.523941 -0.124658 -0.033283 -0.131111 0.018017 -0.146340 -0.111048 0.226687 0.420423 -0.281292 -0.081347 -0.229256 0.377884 -0.296962 -0.280215 0.108348 -0.175602 0.072179 -0.126116 -0.231526 -0.126338 -0.180164 -0.153003 0.482022 0.242933 -0.155751 -0.125292 0.090239 0.097986 0.081052 0.086115 0.058109 0.069280 0.100112 0.115162 0.119930 0.153840 0.128879 0.139174 0.081290 0.091814 0.080899 0.126524 0.126141 0.139031 0.143299 0.160765 0.160028 0.108666 0.142265 0.112083 0.129712 0.123723 0.123863 0.122948
qa: -0.2415 -0.3321 -0.4946 -0.2826 -0.2974 -0.5239 -0.1247 -0.0333 -0.1311 0.0180 -0.1463 -0.1110 0.2267 0.4204 -0.2813 -0.0813 -0.2293 0.3779 -0.2970 -0.2802 0.1083 -0.1756 0.0722 -0.1261 -0.2315 -0.1263 -0.1802 -0.1530 0.4820 0.2429 -0.1558 -0.1253 0.0902 0.0980 0.0811 0.0861 0.0581 0.0693 0.1001 0.1152 0.1199 0.1538 0.1289 0.1392 0.0813 0.0918 0.0809 0.1265 0.1261 0.1390 0.1433 0.1608 0.1600 0.1087 0.1423 0.1121 0.1297 0.1237 0.1239 0.1229
va: 2.1801 2.0640 2.0126 2.1012 2.1244 1.9741 3.8233 3.3917 3.8447 3.6739 3.6257 3.8843 3.9324 4.2726 3.9515 3.8207 3.9501 3.6479 4.0082 3.9303 3.7323 3.6851 3.3642 3.8838 3.9784 3.4447 3.9145 3.8927 4.1007 3.9647 3.8674 3.8498 1.0218 1.0005 1.0149 1.0120 1.0083 1.0072 1.0075 0.9954 0.9922 0.9931 1.0302 1.0124 1.0003 1.0042 0.9980 0.9976 0.9929 1.0011 1.0090 0.9898 0.9905 1.0269 0.9964 0.9883 0.9931 0.9937 0.9868 0.9874
dispcorr: -0.036840301 hartree
energy: -1459.159343382436
dipole: 28.13151 -29.41710 -1.28559 -6.40923 4.20847 -2.20075 9.13774 -10.85823 -1.72049
magnitude: 3.07508 au
magnitude: 7.81624 debye
