program: Orca
programVersion: 5.0.4
elementType: O O O O O O C C C C C C C C C C C C C C C C C C C C C C C C C C H H H H H H H H H H H H H H H H H H H H H H H H H H H H
charge: 0
multiplicity: 1
keywords: wb97x-d3
keywords: def2-TZVPP
keywords: def2/J RIJCOSX
keywords: DEFGRID2
keywords: scfconv7
keywords: smallprint printgap noloewdin
keywords: NOSOSCF
formula: C26H28O6
InChI: InChI=1/C26H28O6/c1-5-6-10-21-17(2)20-13-12-19(14-24(20)32-26(21)28)31-15-18-9-7-8-11-22(18)23(16-29-3)25(27)30-4/h7-9,11-14,16H,5-6,10,15H2,1-4H3
60 atoms
O  1.956022 0.969433 -1.039621
O  -1.876125 -1.700075 -1.848103
O  3.63041 2.324768 -0.707322
O  -1.294228 0.36798 1.521504
O  -4.930968 -1.541346 -0.648131
O  -2.22894 -1.437398 2.443035
C  4.811629 0.820325 1.378627
C  3.556369 0.397519 0.671656
C  6.071305 0.332088 0.659732
C  2.892149 -0.765011 0.911666
C  1.690593 -1.06481 0.166994
C  7.36307 0.710031 1.376356
C  1.246041 -0.154707 -0.784285
C  3.090395 1.29209 -0.370456
C  3.337662 -1.759476 1.932048
C  0.904163 -2.208769 0.367296
C  0.074221 -0.322497 -1.507789
C  -0.697497 -1.446008 -1.255524
C  -0.267163 -2.399956 -0.323023
C  7.612259 2.209357 1.451503
C  -2.520562 -0.680513 -2.586417
C  -2.871106 0.580255 -1.829003
C  -3.169136 0.654413 -0.462857
C  -2.940356 1.741242 -2.599646
C  -3.519962 1.893996 0.079614
C  -3.155634 -0.513535 0.450289
C  -3.306159 2.958001 -2.052718
C  -3.595638 3.035844 -0.697607
C  -2.207578 -0.595166 1.56545
C  -4.024585 -1.530905 0.315755
C  -0.335896 0.42614 2.576452
C  -5.731355 -2.718404 -0.755045
H  4.826973 1.90748 1.463775
H  4.813635 0.444938 2.402847
H  6.087862 0.730001 -0.359456
H  6.01868 -0.75613 0.563376
H  7.351895 0.288593 2.386184
H  8.199631 0.234053 0.858717
H  2.572231 -1.888416 2.700016
H  3.492195 -2.736188 1.471605
H  4.26239 -1.478995 2.425643
H  1.205979 -2.95095 1.09299
H  -0.208529 0.429949 -2.231376
H  -0.874561 -3.276514 -0.140114
H  8.577441 2.424682 1.911368
H  6.853233 2.723605 2.042177
H  7.615048 2.658894 0.456473
H  -1.920791 -0.413292 -3.462431
H  -3.430252 -1.147887 -2.966098
H  -2.696539 1.684959 -3.654124
H  -3.755407 1.955146 1.135059
H  -3.355235 3.839295 -2.678295
H  -3.879207 3.978497 -0.248713
H  -4.012191 -2.380237 0.994734
H  -0.813905 0.637105 3.533395
H  0.239606 -0.495259 2.657955
H  0.332852 1.244376 2.326037
H  -6.452289 -2.53632 -1.546941
H  -5.120026 -3.5821 -1.017853
H  -6.263556 -2.917209 0.176059
elementType: O C H
totalener: -1459.12324560 hartree
nucrepener: 3347.77664407 hartree
electener: -4806.89988967 hartree
oneelecener: -8647.47296009 hartree
twoeener: 3840.57307041 hartree
cpcmener: -0.05618054 hartree
kineticenergy: 1452.84472505 hartree
xcener: -140.277582924437 hartree
chargesum: 0.0000000
charge: -0.239853 -0.330265 -0.494647 -0.282285 -0.298428 -0.523354 -0.127955 -0.029344 -0.131744 0.012312 -0.129771 -0.109773 0.221350 0.420686 -0.280930 -0.103308 -0.225424 0.354701 -0.268220 -0.280166 0.114544 -0.176450 0.071526 -0.123710 -0.228752 -0.130856 -0.179264 -0.154014 0.475677 0.242630 -0.148033 -0.129054 0.091312 0.098072 0.081025 0.085359 0.057857 0.068747 0.117870 0.117883 0.101959 0.154704 0.128070 0.139878 0.092249 0.081153 0.081186 0.124086 0.125005 0.139466 0.143728 0.161005 0.160697 0.109493 0.141322 0.110326 0.126380 0.124392 0.124928 0.124021
qa: -0.2399 -0.3303 -0.4946 -0.2823 -0.2984 -0.5234 -0.1280 -0.0293 -0.1317 0.0123 -0.1298 -0.1098 0.2214 0.4207 -0.2809 -0.1033 -0.2254 0.3547 -0.2682 -0.2802 0.1145 -0.1765 0.0715 -0.1237 -0.2288 -0.1309 -0.1793 -0.1540 0.4757 0.2426 -0.1480 -0.1291 0.0913 0.0981 0.0810 0.0854 0.0579 0.0687 0.1179 0.1179 0.1020 0.1547 0.1281 0.1399 0.0922 0.0812 0.0812 0.1241 0.1250 0.1395 0.1437 0.1610 0.1607 0.1095 0.1413 0.1103 0.1264 0.1244 0.1249 0.1240
va: 2.1834 2.0692 2.0118 2.1000 2.1235 1.9743 3.8218 3.3917 3.8448 3.6982 3.6113 3.8842 3.9535 4.2767 3.9506 3.8197 3.9386 3.6887 3.9728 3.9296 3.7287 3.7018 3.3554 3.8774 3.9855 3.4472 3.9136 3.8935 4.1123 3.9666 3.8624 3.8516 1.0203 1.0009 1.0159 1.0124 1.0083 1.0072 0.9935 0.9923 1.0073 0.9933 1.0308 1.0127 1.0040 0.9979 1.0004 0.9974 0.9932 1.0015 1.0085 0.9898 0.9902 1.0266 0.9968 0.9887 0.9942 0.9937 0.9861 0.9867
dispcorr: -0.036284528 hartree
energy: -1459.159530127352
dipole: 27.41615 -29.10778 -1.69164 -0.88836 -1.57851 -2.46687 12.00787 -11.79840 0.20947
magnitude: 2.99849 au
magnitude: 7.62156 debye
