program: Orca
programVersion: 5.0.4
elementType: O O O O O O C C C C C C C C C C C C C C C C C C C C C C C C C C H H H H H H H H H H H H H H H H H H H H H H H H H H H H
charge: 0
multiplicity: 1
keywords: wb97x-d3
keywords: def2-TZVPP
keywords: def2/J RIJCOSX
keywords: DEFGRID2
keywords: scfconv7
keywords: smallprint printgap noloewdin
keywords: NOSOSCF
formula: C26H28O6
InChI: InChI=1/C26H28O6/c1-5-6-10-21-17(2)20-13-12-19(14-24(20)32-26(21)28)31-15-18-9-7-8-11-22(18)23(16-29-3)25(27)30-4/h7-9,11-14,16H,5-6,10,15H2,1-4H3
60 atoms
O  1.777262 1.361831 -0.797553
O  -1.82906 -1.389145 -2.170285
O  3.325665 2.757785 -0.161947
O  -1.241006 0.202334 1.530643
O  -4.740846 -1.697776 -0.859833
O  -1.973216 -1.807872 2.166981
C  4.71684 0.911539 1.483394
C  3.467547 0.564027 0.726358
C  5.976704 0.64511 0.657129
C  2.909723 -0.676039 0.704449
C  1.715764 -0.905967 -0.0760
C  7.269148 1.020928 1.373015
C  1.178314 0.147506 -0.805102
C  2.892758 1.628221 -0.073664
C  3.473334 -1.830534 1.465789
C  1.027932 -2.12783 -0.125167
C  0.014823 0.039428 -1.553581
C  -0.660413 -1.170838 -1.544916
C  -0.138102 -2.262759 -0.837258
C  7.537107 0.203272 2.628384
C  -2.556524 -0.297316 -2.697213
C  -2.966172 0.784522 -1.722312
C  -3.197459 0.613255 -0.351562
C  -3.155183 2.046971 -2.286759
C  -3.604365 1.719414 0.401341
C  -3.04392 -0.67737 0.360937
C  -3.569265 3.128956 -1.531071
C  -3.793114 2.964022 -0.171423
C  -2.059103 -0.83937 1.436172
C  -3.809297 -1.745788 0.077407
C  -0.251704 0.18541 2.557548
C  -5.413412 -2.921707 -1.149492
H  4.692767 1.963255 1.774289
H  4.751467 0.348723 2.415874
H  5.909141 1.202019 -0.2815
H  6.007481 -0.414136 0.382263
H  8.101847 0.891355 0.677053
H  7.248232 2.085484 1.625083
H  3.70188 -2.656307 0.790275
H  4.382915 -1.583405 2.003919
H  2.745899 -2.204887 2.188814
H  1.403956 -2.981154 0.421965
H  -0.341837 0.90426 -2.096105
H  -0.671584 -3.204289 -0.843061
H  6.788306 0.37786 3.401946
H  8.508034 0.450776 3.059315
H  7.539334 -0.866329 2.407913
H  -1.99733 0.16129 -3.519538
H  -3.445847 -0.74676 -3.141517
H  -2.96265 2.181852 -3.34491
H  -3.788456 1.591389 1.461061
H  -3.707505 4.094796 -1.998879
H  -4.112267 3.798284 0.438899
H  -3.691842 -2.684506 0.61313
H  0.365709 1.064048 2.392152
H  -0.709758 0.253118 3.54489
H  0.373544 -0.705332 2.511781
H  -5.861962 -3.346369 -0.250497
H  -6.198409 -2.687847 -1.863076
H  -4.729599 -3.646256 -1.592809
elementType: O C H
totalener: -1459.12268957 hartree
nucrepener: 3361.53048222 hartree
electener: -4820.65317178 hartree
oneelecener: -8674.86764405 hartree
twoeener: 3854.21447227 hartree
cpcmener: -0.05556247 hartree
kineticenergy: 1452.84413122 hartree
xcener: -140.278212594784 hartree
chargesum: 0.0000000
charge: -0.240958 -0.331417 -0.494236 -0.282298 -0.297791 -0.523810 -0.126979 -0.031143 -0.130183 0.013798 -0.137343 -0.108146 0.226704 0.421057 -0.275350 -0.092669 -0.232722 0.373730 -0.288374 -0.283396 0.107359 -0.171338 0.069389 -0.126516 -0.230459 -0.131258 -0.179081 -0.152683 0.482406 0.244265 -0.152432 -0.126463 0.088600 0.099526 0.084339 0.079559 0.069363 0.057771 0.119738 0.097050 0.116872 0.154694 0.129074 0.138421 0.081145 0.095253 0.080993 0.125802 0.125190 0.139478 0.142585 0.160616 0.160920 0.109395 0.127710 0.142997 0.110254 0.122980 0.123808 0.124203
qa: -0.2410 -0.3314 -0.4942 -0.2823 -0.2978 -0.5238 -0.1270 -0.0311 -0.1302 0.0138 -0.1373 -0.1081 0.2267 0.4211 -0.2753 -0.0927 -0.2327 0.3737 -0.2884 -0.2834 0.1074 -0.1713 0.0694 -0.1265 -0.2305 -0.1313 -0.1791 -0.1527 0.4824 0.2443 -0.1524 -0.1265 0.0886 0.0995 0.0843 0.0796 0.0694 0.0578 0.1197 0.0971 0.1169 0.1547 0.1291 0.1384 0.0811 0.0953 0.0810 0.1258 0.1252 0.1395 0.1426 0.1606 0.1609 0.1094 0.1277 0.1430 0.1103 0.1230 0.1238 0.1242
va: 2.1808 2.0663 2.0130 2.1009 2.1250 1.9739 3.8244 3.3844 3.8529 3.6786 3.6096 3.8820 3.9319 4.2797 3.9512 3.8251 3.9474 3.6574 4.0017 3.9280 3.7327 3.6879 3.3609 3.8809 3.9819 3.4477 3.9132 3.8922 4.1018 3.9633 3.8665 3.8514 1.0249 0.9979 1.0190 1.0083 1.0075 1.0085 0.9927 1.0065 0.9951 0.9931 1.0302 1.0134 0.9981 1.0047 1.0007 0.9974 0.9932 1.0011 1.0094 0.9899 0.9902 1.0270 0.9936 0.9958 0.9896 0.9871 0.9937 0.9865
dispcorr: -0.036821091 hartree
energy: -1459.159510658094
dipole: 28.16346 -29.57894 -1.41548 -5.86586 3.23006 -2.63580 12.60374 -12.99343 -0.38969
magnitude: 3.01710 au
magnitude: 7.66886 debye
