program: Orca
programVersion: 5.0.4
elementType: O O O O O O C C C C C C C C C C C C C C C C C C C C C C C C C C H H H H H H H H H H H H H H H H H H H H H H H H H H H H
charge: 0
multiplicity: 1
keywords: wb97x-d3
keywords: def2-TZVPP
keywords: def2/J RIJCOSX
keywords: DEFGRID2
keywords: scfconv7
keywords: smallprint printgap noloewdin
keywords: NOSOSCF
formula: C26H28O6
InChI: InChI=1/C26H28O6/c1-5-6-10-21-17(2)20-13-12-19(14-24(20)32-26(21)28)31-15-18-9-7-8-11-22(18)23(16-29-3)25(27)30-4/h7-9,11-14,16H,5-6,10,15H2,1-4H3
60 atoms
O  1.956483 0.99955 -1.024131
O  -1.875019 -1.65273 -1.892981
O  3.637902 2.340514 -0.670284
O  -1.30183 0.344692 1.526184
O  -4.913711 -1.561761 -0.687982
O  -2.221918 -1.484756 2.413645
C  4.812428 0.794799 1.390472
C  3.558949 0.38726 0.671751
C  6.0764 0.321318 0.669184
C  2.894029 -0.779759 0.885957
C  1.690159 -1.060532 0.137899
C  7.362551 0.683394 1.403943
C  1.244964 -0.128698 -0.791694
C  3.093867 1.304237 -0.35151
C  3.341892 -1.798686 1.881427
C  0.90275 -2.207781 0.314161
C  0.071905 -0.279362 -1.517219
C  -0.698394 -1.409367 -1.291693
C  -0.268854 -2.383424 -0.379826
C  7.601001 2.18115 1.530299
C  -2.522543 -0.617075 -2.605842
C  -2.880232 0.621523 -1.81567
C  -3.178993 0.657614 -0.448161
C  -2.9537 1.802882 -2.554618
C  -3.534741 1.880767 0.127673
C  -3.155193 -0.531759 0.436661
C  -3.323596 3.00312 -1.9746
C  -3.613725 3.043144 -0.61799
C  -2.20757 -0.626268 1.551858
C  -4.009503 -1.557851 0.277925
C  -0.343375 0.389118 2.581228
C  -5.704719 -2.742999 -0.812325
H  4.827987 1.880267 1.496114
H  4.808999 0.400614 2.407679
H  6.100219 0.742899 -0.340279
H  6.02467 -0.764399 0.547158
H  7.349181 0.22891 2.39929
H  8.204807 0.230095 0.87525
H  3.482099 -2.767344 1.399609
H  4.275041 -1.53675 2.369331
H  2.583794 -1.936409 2.655346
H  1.205025 -2.965796 1.02314
H  -0.211683 0.489662 -2.222919
H  -0.876854 -3.263573 -0.216766
H  6.841862 2.668223 2.143504
H  7.593102 2.665121 0.551553
H  8.567475 2.388366 1.991356
H  -1.922264 -0.324002 -3.473268
H  -3.429289 -1.078358 -2.999934
H  -2.709061 1.776405 -3.610074
H  -3.769886 1.912133 1.184507
H  -3.374869 3.901386 -2.575522
H  -3.899486 3.97245 -0.143232
H  -3.986342 -2.420399 0.939623
H  0.230762 -0.534125 2.652309
H  0.327031 1.209303 2.340813
H  -0.821553 0.589886 3.540489
H  -6.429946 -2.553858 -1.598726
H  -5.0875 -3.597442 -1.091629
H  -6.232479 -2.962046 0.116827
elementType: O C H
totalener: -1459.12330761 hartree
nucrepener: 3347.38689838 hartree
electener: -4806.51020598 hartree
oneelecener: -8646.68451243 hartree
twoeener: 3840.17430645 hartree
cpcmener: -0.05608384 hartree
kineticenergy: 1452.84054618 hartree
xcener: -140.276771060165 hartree
chargesum: 0.0000000
charge: -0.239751 -0.330027 -0.494675 -0.282370 -0.298387 -0.523130 -0.128684 -0.028335 -0.131836 0.012377 -0.127090 -0.109941 0.219759 0.420939 -0.280964 -0.105384 -0.224265 0.353774 -0.268099 -0.281428 0.113357 -0.176034 0.070917 -0.124788 -0.228872 -0.130997 -0.179153 -0.153502 0.475858 0.244274 -0.148049 -0.128539 0.091486 0.098120 0.081251 0.085205 0.058104 0.068929 0.117427 0.101486 0.118574 0.154920 0.127730 0.140332 0.081644 0.081505 0.092461 0.124250 0.124621 0.139786 0.143789 0.160880 0.160741 0.109210 0.110052 0.126247 0.141457 0.124259 0.124793 0.123787
qa: -0.2398 -0.3300 -0.4947 -0.2824 -0.2984 -0.5231 -0.1287 -0.0283 -0.1318 0.0124 -0.1271 -0.1099 0.2198 0.4209 -0.2810 -0.1054 -0.2243 0.3538 -0.2681 -0.2814 0.1134 -0.1760 0.0709 -0.1248 -0.2289 -0.1310 -0.1792 -0.1535 0.4759 0.2443 -0.1480 -0.1285 0.0915 0.0981 0.0813 0.0852 0.0581 0.0689 0.1174 0.1015 0.1186 0.1549 0.1277 0.1403 0.0816 0.0815 0.0925 0.1242 0.1246 0.1398 0.1438 0.1609 0.1607 0.1092 0.1101 0.1262 0.1415 0.1243 0.1248 0.1238
va: 2.1835 2.0690 2.0118 2.0997 2.1238 1.9747 3.8217 3.3904 3.8443 3.7000 3.6108 3.8826 3.9546 4.2764 3.9506 3.8210 3.9389 3.6905 3.9723 3.9296 3.7299 3.7014 3.3577 3.8782 3.9840 3.4468 3.9136 3.8931 4.1118 3.9642 3.8627 3.8517 1.0200 1.0006 1.0159 1.0126 1.0084 1.0073 0.9923 1.0073 0.9934 0.9933 1.0309 1.0124 0.9977 1.0003 1.0041 0.9972 0.9936 1.0014 1.0084 0.9898 0.9901 1.0268 0.9891 0.9942 0.9966 0.9937 0.9861 0.9867
dispcorr: -0.036270042 hartree
energy: -1459.159577646644
dipole: 27.43222 -29.11848 -1.68626 -1.16808 -1.30548 -2.47356 12.10747 -11.94086 0.16661
magnitude: 2.99828 au
magnitude: 7.62103 debye
