program: Orca
programVersion: 5.0.4
elementType: O O O O O O C C C C C C C C C C C C C C C C C C C C C C C C C C H H H H H H H H H H H H H H H H H H H H H H H H H H H H
charge: 0
multiplicity: 1
keywords: wb97x-d3
keywords: def2-TZVPP
keywords: def2/J RIJCOSX
keywords: DEFGRID2
keywords: scfconv7
keywords: smallprint printgap noloewdin
keywords: NOSOSCF
formula: C26H28O6
InChI: InChI=1/C26H28O6/c1-5-6-10-21-17(2)20-13-12-19(14-24(20)32-26(21)28)31-15-18-9-7-8-11-22(18)23(16-29-3)25(27)30-4/h7-9,11-14,16H,5-6,10,15H2,1-4H3
60 atoms
O  1.853228 1.303287 -1.207627
O  -2.274936 1.818526 1.059609
O  3.64906 0.980409 -2.399024
O  -4.917217 -0.090392 1.021035
O  -0.676963 -1.746963 0.097224
O  -3.722862 -0.896914 2.728795
C  5.280833 0.145466 -0.233205
C  3.835164 0.52015 -0.079018
C  5.471214 -1.337602 -0.551616
C  3.139847 0.424483 1.086213
C  1.744505 0.799022 1.116148
C  6.93549 -1.709196 -0.738985
C  1.144451 1.239853 -0.056492
C  3.155773 0.934521 -1.292029
C  3.750206 -0.069555 2.356203
C  0.934195 0.741251 2.260384
C  -0.187443 1.621244 -0.132936
C  -0.963173 1.530597 1.011467
C  -0.392605 1.092138 2.215261
C  7.132782 -3.189504 -1.024588
C  -2.970416 2.11364 -0.137835
C  -3.011604 1.002707 -1.160473
C  -2.961885 -0.363115 -0.852127
C  -3.140858 1.394166 -2.491003
C  -3.037954 -1.288861 -1.894036
C  -2.800848 -0.87587 0.528402
C  -3.228517 0.464408 -3.51379
C  -3.17367 -0.888381 -3.213082
C  -3.823946 -0.636131 1.545289
C  -1.697301 -1.543198 0.915722
C  -5.976272 0.260569 1.908208
C  0.405913 -2.520416 0.608024
H  5.732223 0.745553 -1.025352
H  5.831476 0.395185 0.674859
H  4.909782 -1.591835 -1.456053
H  5.039853 -1.937493 0.256289
H  7.356252 -1.117147 -1.557238
H  7.497327 -1.430747 0.157736
H  4.798068 -0.332162 2.252325
H  3.668211 0.681282 3.143897
H  3.219653 -0.956615 2.707266
H  1.350851 0.402743 3.198875
H  -0.579216 1.960206 -1.082001
H  -1.009552 1.02111 3.101593
H  6.758982 -3.80408 -0.203595
H  8.186734 -3.433486 -1.163696
H  6.602836 -3.492908 -1.929401
H  -3.982478 2.362473 0.185284
H  -2.559554 3.017094 -0.600155
H  -3.163308 2.451544 -2.728462
H  -3.00405 -2.345153 -1.65833
H  -3.329234 0.796515 -4.538642
H  -3.234443 -1.628755 -3.99979
H  -1.603524 -1.928505 1.927948
H  -6.744247 0.716472 1.289558
H  -6.392394 -0.616217 2.404362
H  -5.64902 0.980458 2.658384
H  0.754968 -2.134645 1.56708
H  0.115366 -3.565668 0.723684
H  1.211883 -2.453115 -0.117901
elementType: O C H
totalener: -1459.12568605 hartree
nucrepener: 3343.51259944 hartree
electener: -4802.63828549 hartree
oneelecener: -8638.35241913 hartree
twoeener: 3835.71413364 hartree
cpcmener: -0.05625713 hartree
kineticenergy: 1452.84513144 hartree
xcener: -140.277031607415 hartree
chargesum: -0.0000000
charge: -0.238384 -0.329786 -0.494160 -0.289222 -0.298428 -0.526243 -0.122070 -0.020427 -0.130998 0.025811 -0.114647 -0.092771 0.192900 0.420395 -0.283723 -0.140753 -0.199424 0.353918 -0.248911 -0.278999 0.108925 -0.162943 0.057095 -0.137632 -0.210854 -0.128827 -0.170224 -0.160506 0.501848 0.198591 -0.142460 -0.133268 0.088639 0.097049 0.077000 0.073934 0.060160 0.058868 0.100292 0.119941 0.116878 0.154367 0.130468 0.137090 0.079048 0.090476 0.078606 0.128112 0.124888 0.140381 0.146615 0.161145 0.159903 0.126446 0.126617 0.122707 0.117656 0.113619 0.141605 0.123669
qa: -0.2384 -0.3298 -0.4942 -0.2892 -0.2984 -0.5262 -0.1221 -0.0204 -0.1310 0.0258 -0.1146 -0.0928 0.1929 0.4204 -0.2837 -0.1408 -0.1994 0.3539 -0.2489 -0.2790 0.1089 -0.1629 0.0571 -0.1376 -0.2109 -0.1288 -0.1702 -0.1605 0.5018 0.1986 -0.1425 -0.1333 0.0886 0.0970 0.0770 0.0739 0.0602 0.0589 0.1003 0.1199 0.1169 0.1544 0.1305 0.1371 0.0790 0.0905 0.0786 0.1281 0.1249 0.1404 0.1466 0.1611 0.1599 0.1264 0.1266 0.1227 0.1177 0.1136 0.1416 0.1237
va: 2.1838 2.0747 2.0126 2.1248 2.0922 1.9763 3.8324 3.4139 3.8353 3.6816 3.6046 3.8697 3.9988 4.2720 3.9500 3.8221 3.9307 3.6888 3.9682 3.9460 3.7450 3.6965 3.3651 3.8922 3.9659 3.4431 3.9041 3.9003 4.1113 3.9276 3.8702 3.8518 1.0235 1.0016 1.0167 1.0089 1.0081 1.0077 1.0063 0.9953 0.9916 0.9939 1.0306 1.0188 1.0006 1.0040 1.0007 0.9895 0.9985 1.0012 1.0078 0.9895 0.9907 1.0252 0.9953 0.9936 0.9929 0.9830 0.9911 0.9920
dispcorr: -0.035838134 hartree
energy: -1459.161524186816
dipole: 29.64168 -29.86993 -0.22825 -16.32448 15.68280 -0.64169 3.75786 -1.85182 1.90604
magnitude: 2.02407 au
magnitude: 5.14476 debye
