program: Orca
programVersion: 5.0.4
elementType: O O O O O O C C C C C C C C C C C C C C C C C C C C C C C C C C H H H H H H H H H H H H H H H H H H H H H H H H H H H H
charge: 0
multiplicity: 1
keywords: wb97x-d3
keywords: def2-TZVPP
keywords: def2/J RIJCOSX
keywords: DEFGRID2
keywords: scfconv7
keywords: smallprint printgap noloewdin
keywords: NOSOSCF
formula: C26H28O6
InChI: InChI=1/C26H28O6/c1-5-6-10-21-17(2)20-13-12-19(14-24(20)32-26(21)28)31-15-18-9-7-8-11-22(18)23(16-29-3)25(27)30-4/h7-9,11-14,16H,5-6,10,15H2,1-4H3
60 atoms
O  1.797661 1.72729 -0.51097
O  -1.921452 -0.420582 -2.513733
O  3.360992 2.813851 0.549591
O  -1.014943 -0.683688 1.34602
O  -4.841035 -1.301312 -1.211109
O  -1.753739 -2.772295 1.070126
C  5.02856 0.555644 0.988018
C  3.710794 0.4840 0.271869
C  4.881304 0.317678 2.492916
C  3.151236 -0.670565 -0.17985
C  1.858629 -0.631815 -0.824542
C  6.190984 0.446818 3.263775
C  1.218135 0.592407 -0.968744
C  2.989841 1.735618 0.136693
C  3.805331 -2.003367 -0.022637
C  1.178888 -1.763637 -1.2989
C  -0.031699 0.732916 -1.554293
C  -0.68745 -0.410432 -1.98284
C  -0.069848 -1.663251 -1.861392
C  7.251319 -0.565717 2.853764
C  -2.720907 0.745256 -2.454032
C  -3.007095 1.290485 -1.073217
C  -3.131799 0.520426 0.089648
C  -3.190158 2.671112 -0.992823
C  -3.432739 1.165194 1.292127
C  -2.969395 -0.952801 0.122178
C  -3.499342 3.294961 0.203228
C  -3.619715 2.53462 1.357736
C  -1.880183 -1.577569 0.879735
C  -3.817958 -1.775162 -0.518995
C  0.083709 -1.161581 2.120337
C  -5.601243 -2.24979 -1.955085
H  5.717656 -0.172064 0.559469
H  5.487824 1.531888 0.820936
H  4.457084 -0.678205 2.658301
H  4.155457 1.029437 2.896164
H  6.585003 1.460389 3.143254
H  5.978691 0.330053 4.329569
H  3.177513 -2.662607 0.580159
H  3.934451 -2.487919 -0.991932
H  4.77846 -1.947632 0.454675
H  1.631493 -2.741284 -1.207471
H  -0.461638 1.721499 -1.637693
H  -0.589506 -2.547909 -2.205615
H  6.878731 -1.588038 2.947492
H  8.139209 -0.481042 3.481573
H  7.574745 -0.427807 1.821186
H  -2.274588 1.537699 -3.063471
H  -3.654116 0.464329 -2.944507
H  -3.07686 3.268963 -1.889734
H  -3.53432 0.571723 2.192451
H  -3.634567 4.368075 0.234798
H  -3.855803 3.004092 2.303625
H  -3.694848 -2.854947 -0.49067
H  0.662262 -1.917575 1.589924
H  0.715223 -0.297541 2.30917
H  -0.255536 -1.569964 3.072915
H  -4.996811 -2.705114 -2.74024
H  -6.002875 -3.028896 -1.305689
H  -6.424439 -1.705178 -2.409293
elementType: O C H
totalener: -1459.12306090 hartree
nucrepener: 3363.07047102 hartree
electener: -4822.19353192 hartree
oneelecener: -8677.92606465 hartree
twoeener: 3855.73253274 hartree
cpcmener: -0.05589658 hartree
kineticenergy: 1452.83866526 hartree
xcener: -140.276222904210 hartree
chargesum: 0.0000000
charge: -0.240552 -0.329291 -0.493075 -0.280625 -0.297492 -0.522272 -0.131932 -0.021646 -0.131333 0.013053 -0.123022 -0.109145 0.221820 0.419923 -0.276527 -0.116054 -0.227421 0.347746 -0.262982 -0.283235 0.115525 -0.175526 0.079962 -0.126136 -0.233677 -0.133797 -0.176229 -0.153780 0.470337 0.240839 -0.145696 -0.128414 0.101079 0.088912 0.079736 0.083963 0.058495 0.068469 0.117680 0.119712 0.097251 0.154923 0.131661 0.139697 0.081496 0.094774 0.081735 0.124327 0.123989 0.140721 0.144156 0.160992 0.161050 0.109203 0.109358 0.122541 0.142549 0.124936 0.123731 0.123518
qa: -0.2406 -0.3293 -0.4931 -0.2806 -0.2975 -0.5223 -0.1319 -0.0216 -0.1313 0.0131 -0.1230 -0.1091 0.2218 0.4199 -0.2765 -0.1161 -0.2274 0.3477 -0.2630 -0.2832 0.1155 -0.1755 0.0800 -0.1261 -0.2337 -0.1338 -0.1762 -0.1538 0.4703 0.2408 -0.1457 -0.1284 0.1011 0.0889 0.0797 0.0840 0.0585 0.0685 0.1177 0.1197 0.0973 0.1549 0.1317 0.1397 0.0815 0.0948 0.0817 0.1243 0.1240 0.1407 0.1442 0.1610 0.1611 0.1092 0.1094 0.1225 0.1425 0.1249 0.1237 0.1235
va: 2.1809 2.0693 2.0144 2.1001 2.1237 1.9762 3.8218 3.3863 3.8577 3.6998 3.6012 3.8856 3.9453 4.2825 3.9505 3.8249 3.9392 3.7077 3.9726 3.9275 3.7237 3.7069 3.3485 3.8723 3.9865 3.4571 3.9121 3.8947 4.1154 3.9734 3.8645 3.8520 0.9975 1.0239 1.0079 1.0184 1.0085 1.0078 0.9913 0.9960 1.0067 0.9937 1.0302 1.0132 1.0004 1.0046 0.9981 0.9979 0.9935 1.0014 1.0086 0.9897 0.9900 1.0267 0.9911 0.9948 0.9961 0.9859 0.9870 0.9937
dispcorr: -0.036708307 hartree
energy: -1459.159769207202
dipole: 25.53785 -26.98093 -1.44307 -9.83347 7.58998 -2.24348 13.65841 -14.91964 -1.26123
magnitude: 2.95066 au
magnitude: 7.49998 debye
