program: Orca
programVersion: 5.0.4
elementType: O O O O O O C C C C C C C C C C C C C C C C C C C C C C C C C C H H H H H H H H H H H H H H H H H H H H H H H H H H H H
charge: 0
multiplicity: 1
keywords: wb97x-d3
keywords: def2-TZVPP
keywords: def2/J RIJCOSX
keywords: DEFGRID2
keywords: scfconv7
keywords: smallprint printgap noloewdin
keywords: NOSOSCF
formula: C26H28O6
InChI: InChI=1/C26H28O6/c1-5-6-10-21-17(2)20-13-12-19(14-24(20)32-26(21)28)31-15-18-9-7-8-11-22(18)23(16-29-3)25(27)30-4/h7-9,11-14,16H,5-6,10,15H2,1-4H3
60 atoms
O  1.745787 1.742918 0.356283
O  -1.974191 0.818248 -2.430958
O  3.323688 2.194801 1.789439
O  -0.894375 -1.29537 0.810173
O  -4.756935 -0.759152 -1.716846
O  -1.564007 -3.009948 -0.453594
C  5.012683 0.038313 1.044464
C  3.695038 0.321689 0.381938
C  4.866014 -0.946404 2.207178
C  3.150977 -0.44911 -0.597864
C  1.850304 -0.113554 -1.13003
C  6.187229 -1.295413 2.884057
C  1.180472 0.990329 -0.617137
C  2.954186 1.455619 0.901614
C  3.830559 -1.659351 -1.147631
C  1.1874 -0.855313 -2.119254
C  -0.08467 1.375032 -1.036778
C  -0.72525 0.596555 -1.988068
C  -0.074722 -0.516221 -2.540293
C  6.853377 -0.121045 3.586321
C  -2.794563 1.763146 -1.772494
C  -3.056238 1.521877 -0.302716
C  -3.098624 0.269508 0.322944
C  -3.304935 2.665875 0.456306
C  -3.382961 0.214022 1.690463
C  -2.869416 -1.015301 -0.380451
C  -3.59915 2.594107 1.806305
C  -3.634722 1.355201 2.43056
C  -1.738209 -1.882093 -0.0315
C  -3.696903 -1.457256 -1.343676
C  0.239532 -2.041957 1.248781
C  -5.48728 -1.264167 -2.833293
H  5.721575 -0.362769 0.318104
H  5.449542 0.972508 1.397865
H  4.402059 -1.863186 1.832078
H  4.172763 -0.533855 2.947218
H  6.004937 -2.089815 3.612222
H  6.872384 -1.716508 2.141885
H  3.971665 -1.565988 -2.225719
H  4.800506 -1.844798 -0.697653
H  3.21491 -2.545906 -0.984225
H  1.663984 -1.723773 -2.552183
H  -0.539907 2.249775 -0.593068
H  -0.581241 -1.111702 -3.288389
H  6.185481 0.326317 4.325284
H  7.144711 0.664766 2.888248
H  7.756689 -0.436906 4.109758
H  -2.380859 2.769124 -1.898096
H  -3.735287 1.743053 -2.324863
H  -3.256015 3.635517 -0.025735
H  -3.420617 -0.75237 2.177948
H  -3.787867 3.499614 2.367691
H  -3.855839 1.277536 3.486825
H  -3.523748 -2.40479 -1.848233
H  -0.061484 -2.877504 1.881775
H  0.832163 -2.417599 0.415336
H  0.842849 -1.35218 1.833124
H  -5.829639 -2.283642 -2.650602
H  -6.349087 -0.615894 -2.964396
H  -4.880202 -1.240254 -3.738803
elementType: O C H
totalener: -1459.12301296 hartree
nucrepener: 3370.15390861 hartree
electener: -4829.27692157 hartree
oneelecener: -8692.16963411 hartree
twoeener: 3862.89271254 hartree
cpcmener: -0.05601157 hartree
kineticenergy: 1452.83201116 hartree
xcener: -140.275274613491 hartree
chargesum: -0.0000000
charge: -0.239729 -0.330643 -0.493153 -0.281883 -0.297760 -0.524099 -0.126265 -0.024069 -0.131199 0.010641 -0.131391 -0.110534 0.226361 0.418299 -0.281898 -0.096339 -0.234168 0.365921 -0.280834 -0.281184 0.112123 -0.169139 0.070238 -0.128166 -0.227034 -0.134079 -0.175830 -0.154933 0.479252 0.242455 -0.148616 -0.129389 0.098433 0.088444 0.083819 0.082346 0.069728 0.057949 0.120751 0.100968 0.115995 0.154120 0.129654 0.138883 0.081082 0.081160 0.092357 0.124018 0.124410 0.139722 0.143063 0.160985 0.160239 0.108757 0.143744 0.110018 0.123231 0.124401 0.124101 0.124664
qa: -0.2397 -0.3306 -0.4932 -0.2819 -0.2978 -0.5241 -0.1263 -0.0241 -0.1312 0.0106 -0.1314 -0.1105 0.2264 0.4183 -0.2819 -0.0963 -0.2342 0.3659 -0.2808 -0.2812 0.1121 -0.1691 0.0702 -0.1282 -0.2270 -0.1341 -0.1758 -0.1549 0.4793 0.2425 -0.1486 -0.1294 0.0984 0.0884 0.0838 0.0823 0.0697 0.0579 0.1208 0.1010 0.1160 0.1541 0.1297 0.1389 0.0811 0.0812 0.0924 0.1240 0.1244 0.1397 0.1431 0.1610 0.1602 0.1088 0.1437 0.1100 0.1232 0.1244 0.1241 0.1247
va: 2.1800 2.0677 2.0145 2.1014 2.1235 1.9739 3.8216 3.4004 3.8518 3.6951 3.6118 3.8884 3.9350 4.2747 3.9507 3.8192 3.9424 3.6761 3.9896 3.9297 3.7306 3.6938 3.3574 3.8787 3.9840 3.4553 3.9117 3.8942 4.1048 3.9676 3.8662 3.8514 1.0003 1.0229 1.0131 1.0127 1.0067 1.0083 0.9956 1.0073 0.9914 0.9929 1.0310 1.0135 1.0004 0.9981 1.0042 0.9983 0.9933 1.0013 1.0090 0.9896 0.9904 1.0272 0.9958 0.9903 0.9950 0.9865 0.9937 0.9859
dispcorr: -0.036821967 hartree
energy: -1459.159834931455
dipole: 24.95192 -26.38916 -1.43723 -11.88158 10.47397 -1.40762 9.47667 -11.71956 -2.24289
magnitude: 3.01290 au
magnitude: 7.65819 debye
