program: Gaussian 09
title: 000069396
version: EM64L-G09RevD.01
frameworkgroup: C1[X(C5H11NO2)]
method: RPBEPBE
basis: SDD
operation: Freq
keyword: #p
keyword: freq=noraman
keyword: PBEPBE/SDD
title: #p freq=noraman PBEPBE/SDD
converged: YES YES NO NO
title: Mulliken charges:
elementType: O O N C C C C C H H H H H H H H H H H
charge: -0.207611 -0.207423 0.141416 -0.023438 -0.373076 -0.368873 -0.705726 -0.699838 0.202055 0.227850 0.223263 0.254450 0.238424 0.215486 0.213018 0.220925 0.218699 0.211775 0.218625
chargesum: 0.00000
title: Mulliken charges with hydrogens summed into heavy atoms:
elementType: O O N C C C C C
charge: -0.207611 -0.207423 0.141416 0.178617 0.078036 0.124001 -0.056298 -0.050738
polarizability: 8.11979636e+01 1.18532036e+00 6.73126157e+01 -9.47149662e-01 6.29881099e+00 6.14260438e+01
1716.lowfreq: -19.8319 -12.4942 -8.3642 0.0006 0.0011 0.0011 12.7424 46.6947 97.0150
frequency: -19.4563 46.5926 96.9793 136.2741 215.5881 234.8958 246.0361 354.6259 400.4955 419.0712 444.9529 610.9397 674.4068 783.8912 820.4045 861.1593 916.7847 936.2979 954.2396 981.1019 1041.5260 1126.7073 1133.7427 1177.2338 1200.0480 1235.4455 1267.4726 1273.1962 1319.6694 1333.5581 1346.5306 1380.8689 1398.7166 1427.0031 1445.9149 1465.3935 1470.1034 1474.7113 1484.8678 1490.0956 2963.4530 2972.6488 2975.1885 2989.2058 3046.2810 3051.9134 3065.6292 3072.3588 3073.7040 3078.5331 3131.3409
redmass: 6.3125 3.7087 2.1109 3.7127 1.1426 2.6609 1.1641 2.4990 2.3738 2.3740 2.7551 6.2241 7.5357 1.2870 2.8209 5.2855 1.1805 1.6567 1.3668 1.6526 3.6425 1.5679 2.2066 1.8090 1.5951 5.4517 1.3042 1.2119 1.3743 1.3960 1.4930 1.2087 1.2106 5.0078 1.0750 1.0744 1.0548 1.0616 1.0568 1.0472 1.0831 1.0356 1.0364 1.0588 1.0577 1.1029 1.0994 1.0991 1.0992 1.0990 1.1088
irintensity: 0.1702 2.8246 0.1190 5.1938 0.3144 0.7899 0.2008 1.9563 0.0636 1.3352 0.6852 18.1927 5.2992 5.2485 1.7812 6.1636 3.9950 5.1765 0.0823 0.5683 2.8458 21.6124 9.5553 11.4549 10.5114 83.8512 2.7361 8.8575 2.0369 6.0712 5.7625 19.1134 11.0082 145.7832 8.6749 2.4350 5.9961 9.7237 6.4097 26.8445 17.4927 36.4239 16.7017 19.0069 8.7209 7.1854 17.8945 30.1762 67.4558 62.5431 7.7771
temp: 298.150 k
press: 1.00000 atm
elementType: 8 8 7 6 6 6 6 6 1 1 1 1 1 1 1 1 1 1 1
symmnumber: 1
zpe: 418978.9 jmol-1
zpe.correction: 0.159581 hartree
zpe.thermalcorrener: 0.168337 hartree
zpe.thermalcorrenthalpy: 0.169281 hartree
zpe.thermalcorrgfe: 0.125401 hartree
zpe.sumelectzpe: -401.584675 hartree
zpe.sumelectthermal: -401.575919 hartree
zpe.sumelectthermalent: -401.574974 hartree
zpe.sumelectthermalfe: -401.618854 hartree
dipole: 4.3567 0.7123 -1.1674
dipole: 4.5662
quadrupole: -60.8861 -50.4595 -49.6575
quadrupole: -2.0231 2.1667 -2.5368
quadrupole: -7.2184 3.2082 4.0102 -2.0231 2.1667 -2.5368
hfenergy: -401.7442554 hartree
pointgroup: C01 [X(C5H11N1O2)]
dipole: 1.7114391 -0.3018686 0.4552661 debye
dipolederiv: -0.516821 -0.0964917 -0.1816805 0.0698424 -0.5266339 -0.1940865 -0.1701174 -0.3030577 -0.4693453 -0.5256994 0.2093949 0.050771 0.1522502 -0.5969368 -0.2819493 -0.1068182 -0.1704177 -0.3934528 0.9040785 -0.1905248 0.2310274 -0.3137414 0.8491596 0.5081157 0.4047775 0.50741 0.578255 0.1758203 -0.0097434 0.0173048 -0.0928143 0.1450006 0.0231507 0.1395124 0.0238796 0.1579179 0.0484897 0.0273126 -0.0392029 0.123896 0.0552337 0.0581817 -0.1618266 0.0644451 0.0665043 -0.1230585 0.0177675 -0.0441253 -0.0176902 0.1534931 -0.0134838 -0.0029777 -0.024514 0.177321 -0.0082262 0.0274207 -0.0081357 0.0379413 -0.0805875 0.0178035 -0.0309142 0.0342885 0.0763874 -0.0666884 -0.0349563 0.0419844 -0.002389 0.0108887 0.0567576 -0.0265542 0.0391527 0.0606612 0.0292006 0.0112386 0.0282677 0.0101134 -0.0049231 -0.071843 -0.0019533 -0.0711644 -0.1739467 0.028566 0.0479429 0.0014931 0.0352709 -0.1263689 0.0322223 0.012902 0.0089605 0.0686258 0.0308027 -0.0139301 0.0082461 -0.0305838 0.0535649 -0.0772881 0.0067473 -0.0407886 -0.1037054 0.0642373 -0.0094704 -0.0218345 0.0051013 -0.0632104 0.0277618 -0.0465172 -0.0129598 0.0795831 0.0382663 0.018449 -0.010705 0.0445781 0.0777141 -0.0598249 -0.0173455 -0.0141134 -0.0587105 0.0037956 -0.1131525 0.1177952 -0.0906984 -0.026346 0.0740409 0.1087551 0.0857274 -0.0060048 0.0980196 -0.0118314 -0.0335535 0.0036829 0.0346947 -0.0428149 -0.0050722 -0.1096606 -0.1275965 -0.1667762 0.0690909 -0.0838859 0.019492 0.0758023 -0.0011612 -0.0728539 0.0093202 0.0739607 -0.1814334 -0.0020018 -0.0603672 0.0234994 0.092524 0.0252617 -0.0780893 0.0153888 0.0492836 0.0864764 -0.0251604 -0.0256132 -0.0059342 0.051103 -0.1064141 0.0315885 -0.0498654 -0.1373984 0.0809502 0.0786457 0.0122141 0.0281834 -0.1741723 0.0255699 0.0167571 0.0079689 0.0816605 unknown
polarizability: 81.1388014|-1.4631147|68.338587|0.9370089|5.7526763|60.4592347 unknown
InChI: InChI=1S/C5H11NO2/c1-5(2)3-4-6(7)8/h5H,3-4H2,1-2H3
charge 0 multiplicity 1
19 atoms
O  -2.531238 -0.691904 -0.837484
O  -2.556871 1.130169 0.540348
N  -2.015033 0.059945 0.071666
C  1.883415 0.13086 0.288911
C  0.452133 0.361296 -0.269361
C  -0.635151 -0.31548 0.593445
C  2.274762 -1.366476 0.314395
C  2.899688 0.944649 -0.547802
H  1.909779 0.516426 1.33053
H  0.249308 1.448901 -0.305557
H  0.392133 -0.026937 -1.304766
H  -0.576503 -1.412871 0.543354
H  -0.591907 0.034872 1.637353
H  1.627164 -1.961314 0.984514
H  2.2107 -1.805107 -0.700145
H  3.314651 -1.489471 0.667924
H  3.921751 0.833707 -0.142059
H  2.913519 0.59368 -1.59738
H  2.650102 2.021757 -0.552688
