program: Orca
programVersion: 5.0.4
elementType: O O O O O O C C C C C C C C C C C C C C C C C C C C C C C C C C H H H H H H H H H H H H H H H H H H H H H H H H H H H H
charge: 0
multiplicity: 1
keywords: wb97x-d3
keywords: def2-TZVPP
keywords: def2/J RIJCOSX
keywords: DEFGRID2
keywords: scfconv7
keywords: smallprint printgap noloewdin
keywords: NOSOSCF
formula: C26H28O6
InChI: InChI=1/C26H28O6/c1-5-6-10-21-17(2)20-13-12-19(14-24(20)32-26(21)28)31-15-18-9-7-8-11-22(18)23(16-29-3)25(27)30-4/h7-9,11-14,16H,5-6,10,15H2,1-4H3
60 atoms
O  2.938019 -0.019749 -1.311098
O  -1.452336 1.503729 -0.404536
O  4.901294 -0.807964 -1.827391
O  -2.883152 -0.155278 1.669368
O  -4.529178 -2.732939 -1.817041
O  -2.252006 -2.296463 1.577531
C  6.302649 0.465589 0.247992
C  4.824531 0.644585 0.044265
C  6.667898 -0.84523 0.9538
C  4.005954 1.40616 0.818234
C  2.59138 1.460723 0.516798
C  6.181641 -0.93382 2.393956
C  2.103789 0.724257 -0.556065
C  4.270074 -0.103954 -1.073895
C  4.483252 2.202218 1.989769
C  1.655199 2.210111 1.246107
C  0.762717 0.703443 -0.916803
C  -0.136218 1.449824 -0.169692
C  0.322568 2.211357 0.91635
C  6.565562 -2.248844 3.056216
C  -2.011893 0.698443 -1.439099
C  -3.503136 0.810572 -1.332382
C  -4.269138 -0.1705 -0.692654
C  -4.133092 1.931786 -1.865455
C  -5.652023 -0.008821 -0.620909
C  -3.656286 -1.394734 -0.124243
C  -5.507749 2.086928 -1.782129
C  -6.270069 1.109285 -1.158177
C  -2.859192 -1.357382 1.106836
C  -3.831274 -2.59587 -0.703537
C  -2.097817 0.034391 2.842991
C  -4.698771 -4.061084 -2.302449
H  6.800657 0.494086 -0.723961
H  6.714318 1.302605 0.812085
H  7.75701 -0.947961 0.936166
H  6.277565 -1.693122 0.383652
H  6.595623 -0.10018 2.97007
H  5.094512 -0.81765 2.42867
H  4.244629 3.259789 1.860026
H  3.983984 1.875082 2.903901
H  5.552411 2.122951 2.155517
H  1.978725 2.802735 2.090901
H  0.461232 0.109154 -1.769299
H  -0.384605 2.795248 1.491601
H  6.211295 -2.297522 4.087168
H  7.649048 -2.385072 3.07528
H  6.138421 -3.100915 2.523158
H  -1.668261 1.058785 -2.4139
H  -1.688018 -0.341225 -1.338116
H  -3.536112 2.688589 -2.361772
H  -6.249038 -0.76774 -0.129516
H  -5.981199 2.963532 -2.20573
H  -7.34551 1.214919 -1.091244
H  -3.397741 -3.495067 -0.271047
H  -1.041093 -0.164818 2.661108
H  -2.220741 1.077641 3.12137
H  -2.443696 -0.594927 3.664611
H  -5.22736 -4.682483 -1.577372
H  -5.294378 -3.991202 -3.209376
H  -3.738512 -4.520231 -2.542718
elementType: O C H
totalener: -1459.13720885 hartree
nucrepener: 3154.87799446 hartree
electener: -4614.01520331 hartree
oneelecener: -8261.11161193 hartree
twoeener: 3647.09640862 hartree
cpcmener: -0.04610161 hartree
kineticenergy: 1452.83711691 hartree
xcener: -140.263150176554 hartree
chargesum: 0.0000000
charge: -0.233046 -0.298554 -0.455732 -0.278629 -0.286378 -0.491916 -0.146656 -0.006186 -0.127803 -0.034384 -0.045962 -0.082494 0.106199 0.399507 -0.285275 -0.075128 -0.164706 0.340604 -0.305245 -0.283837 0.047864 -0.100226 0.045655 -0.153998 -0.186346 -0.229538 -0.172363 -0.143729 0.507597 0.251298 -0.154056 -0.125966 0.096747 0.098161 0.074865 0.068422 0.057458 0.061201 0.122620 0.116613 0.098885 0.155578 0.127936 0.139938 0.089893 0.079160 0.079838 0.134100 0.130638 0.141940 0.143592 0.156670 0.156848 0.108379 0.113092 0.127415 0.130459 0.118477 0.121846 0.118659
qa: -0.2330 -0.2986 -0.4557 -0.2786 -0.2864 -0.4919 -0.1467 -0.0062 -0.1278 -0.0344 -0.0460 -0.0825 0.1062 0.3995 -0.2853 -0.0751 -0.1647 0.3406 -0.3052 -0.2838 0.0479 -0.1002 0.0457 -0.1540 -0.1863 -0.2295 -0.1724 -0.1437 0.5076 0.2513 -0.1541 -0.1260 0.0967 0.0982 0.0749 0.0684 0.0575 0.0612 0.1226 0.1166 0.0989 0.1556 0.1279 0.1399 0.0899 0.0792 0.0798 0.1341 0.1306 0.1419 0.1436 0.1567 0.1568 0.1084 0.1131 0.1274 0.1305 0.1185 0.1218 0.1187
va: 2.1869 2.0786 2.0605 2.1161 2.1220 2.0236 3.8650 3.3234 3.8533 3.6844 3.7226 3.8554 4.1149 4.2976 3.9358 3.8498 3.9040 3.7754 4.0367 3.9593 3.7431 3.7979 3.5386 3.9270 3.9447 3.4542 3.9165 3.9013 4.1204 3.9642 3.8747 3.8643 1.0184 1.0049 1.0108 1.0187 1.0042 1.0015 0.9959 0.9917 1.0109 0.9934 1.0285 1.0132 1.0028 1.0008 1.0006 0.9902 0.9823 1.0037 1.0064 0.9914 0.9908 1.0273 0.9916 0.9933 0.9963 0.9855 0.9944 0.9851
dispcorr: -0.030615672 hartree
energy: -1459.167824516885
dipole: 23.73307 -25.57538 -1.84231 -5.75632 6.70392 0.94760 16.37820 -15.46977 0.90844
magnitude: 2.26214 au
magnitude: 5.74991 debye
