program: Orca
programVersion: 5.0.4
elementType: O O O O O O C C C C C C C C C C C C C C C C C C C C C C C C C C H H H H H H H H H H H H H H H H H H H H H H H H H H H H
charge: 0
multiplicity: 1
keywords: wb97x-d3
keywords: def2-TZVPP
keywords: def2/J RIJCOSX
keywords: DEFGRID2
keywords: scfconv7
keywords: smallprint printgap noloewdin
keywords: NOSOSCF
formula: C26H28O6
InChI: InChI=1/C26H28O6/c1-5-6-10-21-17(2)20-13-12-19(14-24(20)32-26(21)28)31-15-18-9-7-8-11-22(18)23(16-29-3)25(27)30-4/h7-9,11-14,16H,5-6,10,15H2,1-4H3
60 atoms
O  2.807651 -0.996673 -0.450415
O  -1.315811 1.326255 -0.396323
O  4.646193 -2.154071 -0.581717
O  -3.234096 0.086868 1.56274
O  -4.836124 -2.555919 -1.896091
O  -2.927613 -2.118686 1.717738
C  6.022867 -0.773867 1.444787
C  4.608697 -0.4426 1.05945
C  7.06965 -0.177569 0.49693
C  3.848688 0.541067 1.612555
C  2.50814 0.767716 1.115233
C  7.129502 1.343915 0.510559
C  2.034178 -0.02526 0.077037
C  4.067469 -1.251898 -0.022002
C  4.32335 1.424801 2.720212
C  1.636874 1.754917 1.602582
C  0.768337 0.119692 -0.475028
C  -0.070588 1.098021 0.037305
C  0.377294 1.921732 1.082297
C  8.189832 1.890888 -0.433314
C  -1.857408 0.49683 -1.421122
C  -3.312029 0.833692 -1.550853
C  -4.305011 0.042564 -0.96134
C  -3.675896 1.970975 -2.266305
C  -5.641176 0.406827 -1.12064
C  -3.975814 -1.194845 -0.213711
C  -5.006777 2.327806 -2.412307
C  -5.993374 1.539671 -1.837399
C  -3.330251 -1.153316 1.102978
C  -4.265462 -2.410107 -0.71339
C  -2.561223 0.282819 2.802091
C  -5.124953 -3.889584 -2.30456
H  6.228879 -0.43976 2.461408
H  6.141915 -1.858911 1.462496
H  6.884981 -0.526491 -0.523187
H  8.048437 -0.57763 0.778692
H  6.155054 1.75772 0.23519
H  7.331892 1.692017 1.528248
H  3.649103 1.364016 3.576395
H  5.320433 1.177616 3.068921
H  4.336781 2.468318 2.400028
H  1.952892 2.405136 2.406731
H  0.476249 -0.533383 -1.286292
H  -0.278845 2.688321 1.473766
H  7.996328 1.590777 -1.465237
H  9.185444 1.528478 -0.169231
H  8.221525 2.981342 -0.410452
H  -1.334594 0.689172 -2.363826
H  -1.71926 -0.559944 -1.17703
H  -2.904922 2.578015 -2.726648
H  -6.413721 -0.203003 -0.669039
H  -5.272518 3.212612 -2.976174
H  -7.037035 1.80417 -1.949212
H  -4.035391 -3.314702 -0.154717
H  -1.537174 -0.090328 2.771559
H  -2.546098 1.356877 2.967007
H  -3.091905 -0.195007 3.626617
H  -4.212708 -4.482264 -2.393006
H  -5.809112 -4.377008 -1.60804
H  -5.600207 -3.822735 -3.279937
elementType: O C H
totalener: -1459.13718579 hartree
nucrepener: 3145.60662299 hartree
electener: -4604.74380878 hartree
oneelecener: -8242.54440434 hartree
twoeener: 3637.80059556 hartree
cpcmener: -0.04617622 hartree
kineticenergy: 1452.84579437 hartree
xcener: -140.265355953446 hartree
chargesum: 0.0000000
charge: -0.233157 -0.298673 -0.455974 -0.278694 -0.286230 -0.491823 -0.146593 -0.007315 -0.128378 -0.035865 -0.046024 -0.081606 0.108749 0.398880 -0.284969 -0.076849 -0.161761 0.337475 -0.302654 -0.285341 0.045344 -0.101969 0.047441 -0.151611 -0.188760 -0.225644 -0.175539 -0.143067 0.505611 0.251325 -0.150857 -0.125576 0.098860 0.096893 0.068950 0.074724 0.061528 0.057550 0.121702 0.100653 0.116833 0.153398 0.127435 0.139821 0.080097 0.079603 0.089899 0.135767 0.128022 0.142586 0.143970 0.157155 0.157035 0.109041 0.111629 0.127302 0.130564 0.119198 0.118126 0.121764
qa: -0.2332 -0.2987 -0.4560 -0.2787 -0.2862 -0.4918 -0.1466 -0.0073 -0.1284 -0.0359 -0.0460 -0.0816 0.1087 0.3989 -0.2850 -0.0768 -0.1618 0.3375 -0.3027 -0.2853 0.0453 -0.1020 0.0474 -0.1516 -0.1888 -0.2256 -0.1755 -0.1431 0.5056 0.2513 -0.1509 -0.1256 0.0989 0.0969 0.0690 0.0747 0.0615 0.0575 0.1217 0.1007 0.1168 0.1534 0.1274 0.1398 0.0801 0.0796 0.0899 0.1358 0.1280 0.1426 0.1440 0.1572 0.1570 0.1090 0.1116 0.1273 0.1306 0.1192 0.1181 0.1218
va: 2.1866 2.0776 2.0604 2.1180 2.1227 2.0234 3.8651 3.3256 3.8538 3.6871 3.7197 3.8536 4.1112 4.2998 3.9370 3.8515 3.8989 3.7737 4.0378 3.9592 3.7449 3.7902 3.5432 3.9259 3.9442 3.4533 3.9195 3.9002 4.1227 3.9631 3.8745 3.8639 1.0046 1.0191 1.0184 1.0108 1.0014 1.0043 0.9965 1.0104 0.9915 0.9943 1.0291 1.0136 1.0005 1.0008 1.0028 0.9907 0.9830 1.0033 1.0065 0.9914 0.9908 1.0273 0.9922 0.9932 0.9961 0.9850 0.9854 0.9944
dispcorr: -0.030685223 hartree
energy: -1459.167871016773
dipole: 28.54905 -30.22690 -1.67784 7.99379 -6.55562 1.43816 5.00856 -4.59992 0.40863
magnitude: 2.24732 au
magnitude: 5.71223 debye
