program: Gaussian 09
title: 000069392
version: EM64L-G09RevD.01
frameworkgroup: C1[X(C4H8O)]
method: RPBEPBE
basis: SDD
operation: Freq
keyword: #p
keyword: freq=noraman
keyword: PBEPBE/SDD
title: #p freq=noraman PBEPBE/SDD
converged: YES YES NO NO
title: Mulliken charges:
elementType: O C C C C H H H H H H H H
charge: -0.275191 -0.317430 -0.045834 -0.497516 -0.558934 0.199339 0.191558 0.233755 0.199219 0.234948 0.200607 0.219758 0.215719
chargesum: 0.00000
title: Mulliken charges with hydrogens summed into heavy atoms:
elementType: O C C C C
charge: -0.275191 0.073467 0.187922 0.137259 -0.123457
polarizability: 6.69548646e+01 3.19805165e+00 4.02936428e+01 -4.93902173e+00 -2.92285674e+00 3.36649317e+01
1716.lowfreq: -0.0005 0.0002 0.0005 7.8944 12.2211 25.5187 88.7557 96.9519 217.0854
frequency: 88.5054 96.7977 217.0835 228.7000 401.5998 422.1654 618.5605 873.3135 934.8017 949.8777 971.9109 1012.2811 1055.7215 1109.0834 1137.6048 1160.8509 1211.3411 1279.9238 1350.5394 1428.0406 1439.6664 1456.9067 1465.1658 1478.8631 1666.1239 2897.1340 2922.4184 2964.0267 2993.9773 3090.2137 3102.9394 3120.4166 3199.9402
redmass: 2.8141 2.2526 1.6253 1.5240 2.9787 2.2352 1.4952 3.0435 1.7329 1.3668 1.6057 1.2142 6.8981 1.2744 1.5795 1.4222 1.2899 1.2423 1.2764 1.1472 1.1878 1.0542 1.0817 1.0659 4.8388 1.0593 1.0354 1.0987 1.1025 1.0604 1.0968 1.0944 1.1142
irintensity: 2.8211 2.8667 3.7177 5.1265 1.5501 1.3392 7.1829 22.3572 12.2018 78.4315 4.3177 30.6435 112.6207 0.1516 6.4162 7.1736 1.2998 0.2719 14.0302 12.3285 12.2225 11.0623 7.7327 6.3655 3.8666 56.7270 98.1679 64.4945 76.4660 11.5858 31.7404 8.6709 28.8289
temp: 298.150 k
press: 1.00000 atm
elementType: 8 6 6 6 6 1 1 1 1 1 1 1 1
symmnumber: 1
zpe: 289176.3 jmol-1
zpe.correction: 0.110141 hartree
zpe.thermalcorrener: 0.116662 hartree
zpe.thermalcorrenthalpy: 0.117606 hartree
zpe.thermalcorrgfe: 0.080255 hartree
zpe.sumelectzpe: -231.976697 hartree
zpe.sumelectthermal: -231.970177 hartree
zpe.sumelectthermalent: -231.969232 hartree
zpe.sumelectthermalfe: -232.006584 hartree
dipole: -0.5155 1.4652 0.9193
dipole: 1.8049
quadrupole: -26.5364 -30.9895 -33.1155
quadrupole: -1.5604 -0.8954 -1.4280
quadrupole: 3.6774 -0.7757 -2.9017 -1.5604 -0.8954 -1.4280
hfenergy: -232.0868383 hartree
pointgroup: C01 [X(C4H8O1)]
dipole: -0.1956053 -0.6823653 -0.0196069 debye
dipolederiv: -1.0547851 0.0183302 0.0315381 0.1036521 -0.4172014 -0.0200856 0.0928921 -0.0099954 -0.4423252 0.6680743 -0.1653927 0.0280934 -0.3522338 0.3809356 0.0867098 -0.0825726 0.06209 0.4394984 0.0453093 0.0871665 0.0647643 0.1220635 -0.0309507 -0.1637078 0.0388611 -0.1583312 -0.0033908 0.6472518 0.0792491 -0.0215032 0.2435606 0.2665164 -0.0079902 -0.0390529 0.0052711 0.3860171 -0.1553291 0.0911754 -0.009332 0.1137928 -0.1658163 -0.232001 0.0229166 -0.2429686 -0.138216 -0.0198397 0.0294428 0.0022337 0.0676671 -0.0509286 0.0980201 -0.0050781 0.1504602 -0.1286193 -0.0950284 -0.0597577 -0.0859295 0.0361714 -0.0738029 -0.1203374 -0.0087754 -0.1580662 -0.0940874 0.0776185 -0.0078559 -0.0244961 -0.0731822 0.0311897 0.1266475 -0.0199354 0.1330005 0.0064618 -0.0261427 -0.028339 -0.0063396 -0.1488893 -0.0409041 -0.1399835 -0.0758799 -0.1418039 -0.1165854 -0.0852365 0.0994241 0.0092803 0.1327113 -0.0313853 -0.0039991 0.0109488 -0.0003974 0.1125642 -0.0188568 -0.0077404 -0.0109705 -0.1198652 -0.0137568 0.1441272 0.075312 0.1330081 -0.1487254 -0.0738721 -0.0995598 0.0189674 -0.1113968 0.0984885 0.0739818 0.0179291 0.0784168 0.1171177 0.0908365 -0.0361426 0.0036938 -0.0140514 0.0476159 0.1586183 -0.0275655 0.1493161 0.0102903 unknown
polarizability: 66.8593546|0.1141939|36.0149468|6.1559812|-4.2511362|38.0391377 unknown
InChI: InChI=1S/C4H8O/c1-3-4-5-2/h3H,1,4H2,2H3
charge 0 multiplicity 1
13 atoms
O  -1.122908 0.496717 -0.000617
C  -0.05661 -0.516004 -0.075517
C  1.242742 0.199696 -0.338814
C  -2.443975 -0.111785 0.140876
C  2.395794 -0.02512 0.337234
H  -0.005121 -1.104266 0.866926
H  -0.283374 -1.221282 -0.910302
H  1.209696 0.931959 -1.157122
H  -2.681285 -0.778867 -0.716411
H  -3.165199 0.720207 0.16589
H  -2.52835 -0.697829 1.081385
H  3.321679 0.500865 0.080183
H  2.448511 -0.740392 1.16759
