program: Orca
programVersion: 5.0.4
elementType: O O O O O O C C C C C C C C C C C C C C C C C C C C C C C C C C H H H H H H H H H H H H H H H H H H H H H H H H H H H H
charge: 0
multiplicity: 1
keywords: wb97x-d3
keywords: def2-TZVPP
keywords: def2/J RIJCOSX
keywords: DEFGRID2
keywords: scfconv7
keywords: smallprint printgap noloewdin
keywords: NOSOSCF
formula: C26H28O6
InChI: InChI=1/C26H28O6/c1-5-6-10-21-17(2)20-13-12-19(14-24(20)32-26(21)28)31-15-18-9-7-8-11-22(18)23(16-29-3)25(27)30-4/h7-9,11-14,16H,5-6,10,15H2,1-4H3
60 atoms
O  3.540175 -0.577909 -1.755115
O  -1.068071 -0.782023 -2.306666
O  5.716885 -0.486626 -1.712575
O  -4.631562 -1.61081 2.386624
O  -5.529002 -1.002543 -1.483221
O  -3.080291 -0.006449 2.378922
C  5.941609 -0.153253 1.088739
C  4.625417 -0.312353 0.383985
C  6.378703 1.309553 1.178882
C  3.415481 -0.259712 1.000234
C  2.209664 -0.402905 0.214058
C  7.708853 1.483449 1.899015
C  2.323379 -0.555153 -1.167409
C  4.698551 -0.460766 -1.061274
C  3.260939 -0.043997 2.469843
C  0.916675 -0.393007 0.744583
C  1.224028 -0.679195 -1.995947
C  -0.049537 -0.660282 -1.437891
C  -0.200898 -0.522765 -0.053504
C  8.127777 2.940915 2.011995
C  -2.403164 -0.747747 -1.828988
C  -2.820718 0.617962 -1.344509
C  -3.716529 0.767446 -0.280432
C  -2.309239 1.753713 -1.969127
C  -4.055043 2.050908 0.14854
C  -4.320949 -0.398135 0.406693
C  -2.658651 3.022351 -1.537698
C  -3.531376 3.173347 -0.469079
C  -3.94246 -0.635009 1.803122
C  -5.190016 -1.212494 -0.221623
C  -4.293813 -1.945252 3.729999
C  -6.406587 -1.955716 -2.076127
H  5.885523 -0.578382 2.092074
H  6.707584 -0.729165 0.56651
H  5.60449 1.884372 1.697943
H  6.449134 1.730884 0.171258
H  7.639379 1.044832 2.899487
H  8.483892 0.918613 1.372155
H  2.692257 0.867992 2.660336
H  2.707515 -0.865259 2.92866
H  4.209618 0.047426 2.989069
H  0.771439 -0.277869 1.810126
H  1.353705 -0.787644 -3.065782
H  -1.172902 -0.506028 0.41689
H  7.390254 3.524125 2.56703
H  8.237083 3.401141 1.02802
H  9.082934 3.043891 2.529201
H  -3.005126 -1.04665 -2.688614
H  -2.549713 -1.506295 -1.054374
H  -1.622139 1.651643 -2.799778
H  -4.744667 2.167807 0.975669
H  -2.248559 3.892118 -2.034616
H  -3.805836 4.160939 -0.121434
H  -5.645266 -2.065354 0.274952
H  -4.967478 -2.749362 4.014643
H  -3.264562 -2.296701 3.810892
H  -4.440734 -1.101806 4.405221
H  -6.593783 -1.618614 -3.092382
H  -5.949464 -2.946007 -2.107952
H  -7.354494 -2.008697 -1.537805
elementType: O C H
totalener: -1459.13745214 hartree
nucrepener: 3121.92272153 hartree
electener: -4581.06017367 hartree
oneelecener: -8195.21857764 hartree
twoeener: 3614.15840396 hartree
cpcmener: -0.04517185 hartree
kineticenergy: 1452.82895466 hartree
xcener: -140.265603105291 hartree
chargesum: -0.0000000
charge: -0.233269 -0.323885 -0.454590 -0.296176 -0.283674 -0.483609 -0.112909 -0.023439 -0.133177 -0.012709 -0.036819 -0.091045 0.201424 0.396920 -0.292660 -0.159330 -0.293405 0.306773 -0.152845 -0.276410 0.095870 -0.138373 0.081629 -0.142374 -0.210681 -0.128108 -0.164080 -0.157334 0.461525 0.208585 -0.126742 -0.131445 0.094415 0.090513 0.072400 0.078521 0.057488 0.060095 0.117842 0.115780 0.099550 0.149848 0.132109 0.111645 0.077517 0.078839 0.089564 0.119920 0.126922 0.140610 0.139353 0.156668 0.155726 0.120324 0.122892 0.115020 0.113201 0.123432 0.122316 0.123853
qa: -0.2333 -0.3239 -0.4546 -0.2962 -0.2837 -0.4836 -0.1129 -0.0234 -0.1332 -0.0127 -0.0368 -0.0910 0.2014 0.3969 -0.2927 -0.1593 -0.2934 0.3068 -0.1528 -0.2764 0.0959 -0.1384 0.0816 -0.1424 -0.2107 -0.1281 -0.1641 -0.1573 0.4615 0.2086 -0.1267 -0.1314 0.0944 0.0905 0.0724 0.0785 0.0575 0.0601 0.1178 0.1158 0.0996 0.1498 0.1321 0.1116 0.0775 0.0788 0.0896 0.1199 0.1269 0.1406 0.1394 0.1567 0.1557 0.1203 0.1229 0.1150 0.1132 0.1234 0.1223 0.1239
va: 2.1844 2.0769 2.0606 2.1023 2.1242 2.0199 3.8297 3.3993 3.8392 3.7268 3.7321 3.8692 3.9884 4.3038 3.9554 3.9686 4.1175 3.8116 3.8963 3.9463 3.7606 3.6532 3.4927 3.8871 3.9981 3.4685 3.9185 3.9063 4.1286 3.9807 3.8790 3.8559 1.0016 1.0244 1.0082 1.0169 1.0078 1.0081 0.9924 0.9956 1.0070 1.0017 1.0262 1.0342 1.0009 1.0012 1.0043 0.9939 0.9962 1.0135 1.0067 0.9911 0.9917 1.0214 0.9957 0.9926 0.9929 0.9943 0.9858 0.9862
dispcorr: -0.029929096 hartree
energy: -1459.167381239421
dipole: 18.64336 -23.14428 -4.50092 6.41758 -7.87510 -1.45752 19.35085 -17.61082 1.74003
magnitude: 5.04087 au
magnitude: 12.81287 debye
