program: Orca
programVersion: 5.0.4
elementType: O O O O O O C C C C C C C C C C C C C C C C C C C C C C C C C C H H H H H H H H H H H H H H H H H H H H H H H H H H H H
charge: 0
multiplicity: 1
keywords: wb97x-d3
keywords: def2-TZVPP
keywords: def2/J RIJCOSX
keywords: DEFGRID2
keywords: scfconv7
keywords: smallprint printgap noloewdin
keywords: NOSOSCF
formula: C26H28O6
InChI: InChI=1/C26H28O6/c1-5-6-10-21-17(2)20-13-12-19(14-24(20)32-26(21)28)31-15-18-9-7-8-11-22(18)23(16-29-3)25(27)30-4/h7-9,11-14,16H,5-6,10,15H2,1-4H3
60 atoms
O  1.954548 1.445259 -1.202458
O  -2.198764 1.819164 1.033348
O  3.755856 1.176971 -2.393447
O  -4.76808 -0.21086 1.042313
O  -0.45029 -1.736236 0.262094
O  -3.572519 -0.897916 2.799428
C  5.377104 0.246101 -0.233736
C  3.940419 0.664649 -0.081737
C  5.564682 -1.272511 -0.312836
C  3.261103 0.62139 1.095968
C  1.860483 0.978611 1.12724
C  4.859952 -1.94021 -1.486661
C  1.247413 1.371813 -0.056124
C  3.260793 1.095887 -1.292922
C  3.895835 0.193185 2.378769
C  1.050318 0.922571 2.271921
C  -0.098896 1.696519 -0.143088
C  -0.876465 1.596733 0.999289
C  -0.289884 1.218314 2.216128
C  5.135218 -3.435098 -1.549357
C  -2.905938 2.025965 -0.174655
C  -2.876418 0.875035 -1.152483
C  -2.764724 -0.472824 -0.786115
C  -2.999995 1.204368 -2.500071
C  -2.770486 -1.442126 -1.790415
C  -2.610004 -0.91967 0.617382
C  -3.018988 0.230975 -3.484927
C  -2.899219 -1.103285 -3.127142
C  -3.662333 -0.685124 1.608375
C  -1.49224 -1.53076 1.051292
C  -5.86319 0.109815 1.893635
C  0.636622 -2.464829 0.82049
H  5.799308 0.706626 -1.12747
H  5.96457 0.632457 0.601199
H  5.220503 -1.730976 0.620011
H  6.637857 -1.478666 -0.373992
H  3.780025 -1.777957 -1.414998
H  5.178168 -1.471228 -2.42215
H  3.741482 0.942672 3.156788
H  3.447579 -0.735447 2.738551
H  4.965058 0.02786 2.289124
H  1.476171 0.623132 3.219884
H  -0.49957 1.995702 -1.101754
H  -0.906453 1.144357 3.1028
H  6.199853 -3.638818 -1.680911
H  4.607433 -3.903781 -2.381401
H  4.816023 -3.938741 -0.634388
H  -3.931968 2.22785 0.137773
H  -2.547723 2.934159 -0.671332
H  -3.071784 2.248499 -2.782976
H  -2.687472 -2.485212 -1.511263
H  -3.115607 0.515401 -4.524724
H  -2.903831 -1.87735 -3.883669
H  -1.409743 -1.873083 2.080164
H  -5.593627 0.868812 2.628879
H  -6.640189 0.504778 1.243986
H  -6.245362 -0.771855 2.409321
H  1.452503 -2.415856 0.103124
H  0.966058 -2.031522 1.766646
H  0.366666 -3.510736 0.979538
elementType: O C H
totalener: -1459.13453882 hartree
nucrepener: 3389.12978956 hartree
electener: -4848.26432838 hartree
oneelecener: -8729.43123310 hartree
twoeener: 3881.16690472 hartree
cpcmener: -0.04556301 hartree
kineticenergy: 1452.85246220 hartree
xcener: -140.276610843965 hartree
chargesum: -0.0000000
charge: -0.232055 -0.318263 -0.453540 -0.285050 -0.287995 -0.495347 -0.130304 -0.043505 -0.139835 0.027226 -0.102463 -0.080037 0.191599 0.405846 -0.293958 -0.153593 -0.186079 0.346607 -0.245347 -0.282177 0.098774 -0.159837 0.070763 -0.135425 -0.210155 -0.133842 -0.166988 -0.155802 0.480820 0.193022 -0.142994 -0.134452 0.093121 0.099821 0.070250 0.076008 0.051821 0.065445 0.116820 0.118936 0.100450 0.152709 0.126407 0.135814 0.081011 0.090762 0.076598 0.127257 0.121296 0.137508 0.142354 0.157174 0.156071 0.124291 0.115950 0.124299 0.121213 0.121372 0.110418 0.139208
qa: -0.2321 -0.3183 -0.4535 -0.2851 -0.2880 -0.4953 -0.1303 -0.0435 -0.1398 0.0272 -0.1025 -0.0800 0.1916 0.4058 -0.2940 -0.1536 -0.1861 0.3466 -0.2453 -0.2822 0.0988 -0.1598 0.0708 -0.1354 -0.2102 -0.1338 -0.1670 -0.1558 0.4808 0.1930 -0.1430 -0.1345 0.0931 0.0998 0.0702 0.0760 0.0518 0.0654 0.1168 0.1189 0.1005 0.1527 0.1264 0.1358 0.0810 0.0908 0.0766 0.1273 0.1213 0.1375 0.1424 0.1572 0.1561 0.1243 0.1159 0.1243 0.1212 0.1214 0.1104 0.1392
va: 2.1929 2.0877 2.0593 2.1253 2.0986 2.0159 3.8580 3.3720 3.8753 3.6444 3.6165 3.8481 4.0138 4.2814 3.9486 3.8298 3.9158 3.7117 3.9697 3.9540 3.7569 3.6965 3.3724 3.8920 3.9735 3.4542 3.9149 3.9067 4.1412 3.9307 3.8765 3.8603 1.0265 1.0015 1.0034 1.0124 1.0079 1.0136 0.9965 0.9910 1.0082 0.9943 1.0328 1.0190 1.0013 1.0031 1.0011 0.9891 0.9983 1.0019 1.0088 0.9908 0.9919 1.0263 0.9931 0.9953 0.9938 0.9908 0.9835 0.9914
dispcorr: -0.037028574 hartree
energy: -1459.171567393232
dipole: 23.41450 -23.66863 -0.25413 -17.39055 16.67970 -0.71085 2.30274 -0.56193 1.74082
magnitude: 1.89745 au
magnitude: 4.82294 debye
