program: Gaussian 09
title: 000074283
version: EM64L-G09RevD.01
frameworkgroup: C1[X(C12H16O2)]
method: RPBEPBE
basis: SDD
operation: Freq
keyword: #pfreq=noraman
keyword: PBEPBE/SDD
title: #p freq=noraman PBEPBE/SDD
converged: NO YES NO NO
title: Mulliken charges:
elementType: O O C C C C C C C C C C C C H H H H H H H H H H H H H H H H
charge: -0.229845 -0.259024 -0.355572 -0.517592 -0.344295 0.108419 0.291533 -0.695332 -0.321701 -0.355987 -0.373990 -0.358618 0.330917 -0.537029 0.210847 0.211395 0.228763 0.228388 0.188635 0.188551 0.213981 0.212118 0.212234 0.247954 0.276454 0.253035 0.244706 0.226203 0.226210 0.248643
chargesum: 0.00000
title: Mulliken charges with hydrogens summed into heavy atoms:
elementType: O O C C C C C C C C C C C C
charge: -0.229845 -0.259024 0.066670 -0.060441 0.032891 0.108419 0.291533 -0.056999 -0.073747 -0.079534 -0.120955 -0.113911 0.330917 0.164028
polarizability: 2.21813621e+02 -7.64888997e+00 1.29586040e+02 1.22579441e-01 7.96871844e-02 7.80257221e+01
1716.lowfreq: -42.0086 -6.5900 0.0008 0.0009 0.0011 1.6891 22.6726 24.2650 66.0696
frequency: -28.5637 23.0608 66.0437 72.2891 80.2501 117.7726 139.1100 168.1961 206.4839 224.4896 236.8433 281.9764 294.8924 319.8837 365.8907 414.9699 459.5573 487.0575 512.4345 566.0005 578.4013 628.2558 716.0433 732.3820 735.6337 793.0073 795.6038 823.9087 840.5913 900.2794 918.6378 965.5217 972.6491 983.4698 987.3187 1003.7903 1043.7292 1084.6350 1089.6703 1110.6079 1111.6631 1114.3720 1157.6234 1171.2416 1202.6851 1214.8616 1237.7355 1271.5738 1272.2551 1282.0943 1300.7602 1330.4165 1353.0217 1375.0506 1390.0418 1427.7959 1432.9099 1437.5552 1461.6833 1468.8421 1472.8154 1473.1068 1477.7958 1486.5671 1499.7179 1560.4103 1587.6897 1622.9242 2953.7832 2958.8337 2968.6980 2974.5260 2994.5810 2997.8388 3003.7199 3054.8153 3059.8767 3072.3769 3073.3693 3133.3560 3144.0522 3145.8815 3165.8027 3171.6647
redmass: 1.6002 3.6722 4.0813 3.2978 4.5642 2.2355 3.1341 4.0512 3.7548 1.1873 1.0916 3.8723 3.6646 4.6967 5.0874 2.9521 3.5506 2.9806 4.0571 2.1073 6.2316 7.0907 1.2369 5.5917 2.4564 1.3782 5.9075 1.2465 1.5883 1.7723 1.3449 1.3550 5.9467 8.6270 1.3458 2.5187 2.6734 2.0735 1.4905 1.9988 1.2596 1.5728 1.3378 1.2545 1.4880 1.7630 3.2636 1.7945 1.1870 1.0563 1.2988 1.7341 1.7869 4.9625 1.2189 2.4991 1.3105 1.2166 1.0726 1.0496 1.0750 1.0706 1.0422 1.0717 2.4894 7.7726 7.6047 6.7079 1.0598 1.0588 1.0327 1.0359 1.0602 1.0966 1.1008 1.1029 1.1043 1.1007 1.0995 1.0999 1.0883 1.0879 1.0956 1.0966
irintensity: 0.0250 0.8356 0.5866 5.0402 0.1755 5.0581 2.7455 6.6456 0.1217 0.0474 0.0046 4.1414 1.9640 4.5816 0.2325 0.0724 10.4095 6.0998 0.6894 11.2437 30.0930 3.0317 14.8019 3.3707 2.3290 11.3147 4.7585 0.0370 71.2905 18.0189 0.7529 0.5690 77.6883 24.4960 0.9242 0.4040 1.8929 1.1991 0.4502 0.3609 0.1832 19.4483 0.6534 209.2290 0.0046 47.1493 177.0834 152.9037 0.2382 0.1697 1.1703 82.6522 9.8322 51.2029 16.5550 3.4654 14.9185 4.0877 1.4702 14.3726 46.0842 12.1078 12.3199 15.3396 23.9463 88.5831 175.4761 132.1057 18.1760 44.1194 66.5279 36.4169 29.3061 16.0729 2.8831 20.2544 43.2808 92.7731 52.2420 23.0804 9.2658 0.8045 15.4731 5.5300
temp: 298.150 k
press: 1.00000 atm
elementType: 8 8 6 6 6 6 6 6 6 6 6 6 6 6 1 1 1 1 1 1 1 1 1 1 1 1 1 1 1 1
symmnumber: 1
zpe: 656808.0 jmol-1
zpe.correction: 0.250165 hartree
zpe.thermalcorrener: 0.264213 hartree
zpe.thermalcorrenthalpy: 0.265158 hartree
zpe.thermalcorrgfe: 0.208179 hartree
zpe.sumelectzpe: -616.253866 hartree
zpe.sumelectthermal: -616.239818 hartree
zpe.sumelectthermalent: -616.238874 hartree
zpe.sumelectthermalfe: -616.295852 hartree
dipole: 2.9366 -1.6198 0.0120
dipole: 3.3538
quadrupole: -65.7176 -87.5556 -86.1847
quadrupole: 12.4305 0.0476 0.0557
quadrupole: 14.1017 -7.7363 -6.3654 12.4305 0.0476 0.0557
hfenergy: -616.5040311 hartree
pointgroup: C01 [X(C12H16O2)]
dipole: 1.1619478 -0.6252239 -0.0002915 debye
polarizability: 221.9630861|-6.6858099|129.4338477|-0.0854622|0.3906989|78.02845 unknown
InChI: InChI=1S/C12H16O2/c1-3-4-5-12(13)10-6-8-11(14-2)9-7-10/h6-9H,3-5H2,1-2H3
charge 0 multiplicity 1
30 atoms
O  -1.491187 1.946171 0.01138
O  4.34087 -0.842211 -0.005586
C  -3.695956 0.187155 0.003508
C  -2.260519 -0.369002 -0.000204
C  -4.762718 -0.930018 0.011213
C  -1.177257 0.716505 0.006577
C  0.260846 0.297152 0.00258
C  -6.203213 -0.374531 0.015186
C  0.671523 -1.067462 -0.00939
C  1.264541 1.301869 0.011667
C  2.031304 -1.411905 -0.011991
C  2.632378 0.975443 0.009517
C  3.018199 -0.391589 -0.002368
C  5.409039 0.164428 0.004307
H  -3.83809 0.838748 -0.879758
H  -3.830759 0.844458 0.883653
H  -2.10552 -1.018323 -0.887794
H  -2.105348 -1.028751 0.879626
H  -4.613839 -1.576815 0.900562
H  -4.621217 -1.582865 -0.874962
H  -6.952519 -1.187216 0.017742
H  -6.38656 0.253378 -0.876862
H  -6.381407 0.254318 0.907588
H  -0.074598 -1.868441 -0.016912
H  0.936936 2.347098 0.020772
H  2.360287 -2.455175 -0.021299
H  3.380804 1.773149 0.017132
H  5.360011 0.791003 0.915232
H  5.361298 0.807497 -0.895111
H  6.343871 -0.413769 -0.000306
