program: Orca
programVersion: 5.0.4
elementType: O O O O O O C C C C C C C C C C C C C C C C C C C C C C C C C C H H H H H H H H H H H H H H H H H H H H H H H H H H H H
charge: 0
multiplicity: 1
keywords: wb97x-d3
keywords: def2-TZVPP
keywords: def2/J RIJCOSX
keywords: DEFGRID2
keywords: scfconv7
keywords: smallprint printgap noloewdin
keywords: NOSOSCF
formula: C26H28O6
InChI: InChI=1/C26H28O6/c1-5-6-10-21-17(2)20-13-12-19(14-24(20)32-26(21)28)31-15-18-9-7-8-11-22(18)23(16-29-3)25(27)30-4/h7-9,11-14,16H,5-6,10,15H2,1-4H3
60 atoms
O  1.623357 -0.690362 -0.038725
O  -1.768922 2.306109 1.344791
O  3.068724 -2.171262 -0.715575
O  -5.332332 -0.542987 0.890633
O  -1.430509 -2.229126 -0.976654
O  -4.563238 -2.488267 1.673727
C  5.32328 -0.4631 -0.559635
C  3.932155 -0.019443 -0.209821
C  6.046152 -1.101249 0.628658
C  3.613332 1.216687 0.259029
C  2.234327 1.528969 0.563473
C  7.427651 -1.645918 0.282196
C  1.273288 0.539413 0.392962
C  2.897141 -1.031504 -0.347205
C  4.630386 2.288171 0.482311
C  1.780743 2.777402 1.016727
C  -0.075785 0.741048 0.642737
C  -0.492395 1.989146 1.076754
C  0.449715 3.011049 1.265585
C  8.416898 -0.58465 -0.177669
C  -2.790008 1.351145 1.092886
C  -3.031995 1.13701 -0.380938
C  -3.319289 -0.130302 -0.901488
C  -2.986175 2.232567 -1.239615
C  -3.537468 -0.266177 -2.272381
C  -3.373175 -1.340144 -0.045717
C  -3.203411 2.083721 -2.599776
C  -3.477342 0.827251 -3.120315
C  -4.453794 -1.540426 0.925257
C  -2.450437 -2.316807 -0.142996
C  -6.417304 -0.589305 1.812603
C  -0.512281 -3.319558 -0.986866
H  5.279654 -1.181798 -1.380751
H  5.896582 0.38272 -0.93871
H  5.431005 -1.913889 1.024867
H  6.134128 -0.364468 1.434185
H  7.83137 -2.152296 1.163134
H  7.330765 -2.415781 -0.489735
H  4.421003 3.159101 -0.141788
H  4.604164 2.627038 1.519345
H  5.644711 1.964467 0.271197
H  2.484787 3.583905 1.170369
H  -0.757518 -0.081597 0.487522
H  0.120014 3.983468 1.608126
H  8.123023 -0.127367 -1.123695
H  9.410595 -1.010903 -0.324148
H  8.510291 0.216481 0.559205
H  -2.566506 0.412871 1.608838
H  -3.678885 1.771688 1.56532
H  -2.771826 3.218068 -0.844709
H  -3.762364 -1.245656 -2.676198
H  -3.160189 2.947808 -3.25022
H  -3.647088 0.698817 -4.181558
H  -2.514041 -3.208688 0.476873
H  -7.044868 -1.46667 1.654303
H  -6.067506 -0.577413 2.845517
H  -7.004726 0.305937 1.62624
H  0.290541 -3.05025 -1.667059
H  -0.096058 -3.498599 0.005495
H  -0.994637 -4.229094 -1.348399
elementType: O C H
totalener: -1459.13859131 hartree
nucrepener: 3228.30996067 hartree
electener: -4687.44855198 hartree
oneelecener: -8407.93342967 hartree
twoeener: 3720.48487769 hartree
cpcmener: -0.03972030 hartree
kineticenergy: 1452.83491913 hartree
xcener: -140.267722792763 hartree
chargesum: 0.0000000
charge: -0.242150 -0.322472 -0.474076 -0.284129 -0.285597 -0.490723 -0.133385 0.035061 -0.128117 -0.011507 -0.040503 -0.108090 0.091804 0.373219 -0.288489 -0.099554 -0.118063 0.291824 -0.260365 -0.283675 0.090278 -0.137529 0.059589 -0.148892 -0.207541 -0.180437 -0.164040 -0.155170 0.495950 0.254192 -0.139924 -0.146626 0.090904 0.096444 0.084717 0.077383 0.068223 0.058869 0.117879 0.114656 0.096212 0.153707 0.113448 0.136630 0.081604 0.094010 0.080348 0.127608 0.123532 0.139327 0.142915 0.157270 0.155865 0.109587 0.120241 0.116727 0.123667 0.120044 0.122065 0.135256
qa: -0.2421 -0.3225 -0.4741 -0.2841 -0.2856 -0.4907 -0.1334 0.0351 -0.1281 -0.0115 -0.0405 -0.1081 0.0918 0.3732 -0.2885 -0.0996 -0.1181 0.2918 -0.2604 -0.2837 0.0903 -0.1375 0.0596 -0.1489 -0.2075 -0.1804 -0.1640 -0.1552 0.4960 0.2542 -0.1399 -0.1466 0.0909 0.0964 0.0847 0.0774 0.0682 0.0589 0.1179 0.1147 0.0962 0.1537 0.1134 0.1366 0.0816 0.0940 0.0803 0.1276 0.1235 0.1393 0.1429 0.1573 0.1559 0.1096 0.1202 0.1167 0.1237 0.1200 0.1221 0.1353
va: 2.2086 2.0890 2.0395 2.1176 2.1177 2.0274 3.8198 3.4491 3.8523 3.7532 3.7518 3.8824 4.1683 4.2501 3.9478 3.8912 3.8139 3.8078 4.0566 3.9290 3.7926 3.6525 3.4748 3.8996 3.9795 3.4559 3.9128 3.9033 4.1225 3.9301 3.8755 3.8490 1.0227 0.9982 1.0201 1.0083 1.0076 1.0086 0.9942 0.9927 1.0075 0.9938 1.0289 1.0150 0.9979 1.0049 1.0003 0.9961 0.9916 1.0136 1.0068 0.9909 0.9916 1.0302 0.9938 0.9928 0.9959 1.0008 0.9885 0.9884
dispcorr: -0.032366016 hartree
energy: -1459.170957324021
dipole: 35.11304 -34.62067 0.49237 -0.91473 2.88865 1.97392 0.34582 -0.15959 0.18623
magnitude: 2.04291 au
magnitude: 5.19265 debye
