program: Orca
programVersion: 5.0.4
elementType: O O O O O O C C C C C C C C C C C C C C C C C C C C C C C C C C H H H H H H H H H H H H H H H H H H H H H H H H H H H H
charge: 0
multiplicity: 1
keywords: wb97x-d3
keywords: def2-TZVPP
keywords: def2/J RIJCOSX
keywords: DEFGRID2
keywords: scfconv7
keywords: smallprint printgap noloewdin
keywords: NOSOSCF
formula: C26H28O6
InChI: InChI=1/C26H28O6/c1-5-6-10-21-17(2)20-13-12-19(14-24(20)32-26(21)28)31-15-18-9-7-8-11-22(18)23(16-29-3)25(27)30-4/h7-9,11-14,16H,5-6,10,15H2,1-4H3
60 atoms
O  1.613098 -0.647505 -0.099694
O  -1.778463 2.329298 1.331455
O  3.058949 -2.106497 -0.823787
O  -5.280929 -0.548097 0.902482
O  -1.412308 -2.275663 -1.00549
O  -4.430078 -2.419083 1.77562
C  5.321272 -0.431008 -0.55872
C  3.927571 0.018169 -0.226043
C  5.998334 -1.127828 0.623385
C  3.609588 1.241687 0.275065
C  2.227518 1.55346 0.565905
C  7.383931 -1.677304 0.302037
C  1.264511 0.572669 0.360522
C  2.887886 -0.981255 -0.412428
C  4.629709 2.296072 0.55818
C  1.774323 2.792843 1.04393
C  -0.085967 0.773095 0.605086
C  -0.501766 2.012264 1.064995
C  0.442157 3.026157 1.284955
C  8.397067 -0.613758 -0.096642
C  -2.797571 1.37041 1.086866
C  -3.036868 1.142766 -0.38549
C  -3.280994 -0.135188 -0.902502
C  -3.022767 2.236603 -1.247261
C  -3.480155 -0.283357 -2.275252
C  -3.318649 -1.33797 -0.038089
C  -3.224756 2.076015 -2.608275
C  -3.448222 0.808321 -3.126537
C  -4.369891 -1.515192 0.969667
C  -2.42151 -2.336338 -0.157723
C  -6.345437 -0.58594 1.848785
C  -0.594986 -3.436421 -1.126589
H  5.290017 -1.113687 -1.410609
H  5.917175 0.420624 -0.885952
H  5.361473 -1.947829 0.966242
H  6.069207 -0.425552 1.460582
H  7.75474 -2.211916 1.180701
H  7.303887 -2.424313 -0.49382
H  4.612246 2.564132 1.616392
H  5.641974 1.987491 0.316704
H  4.416107 3.207289 -0.003702
H  2.480224 3.591796 1.225297
H  -0.768276 -0.043861 0.423576
H  0.111726 3.991256 1.646921
H  8.144422 -0.13695 -1.044935
H  9.393509 -1.043479 -0.210814
H  8.464733 0.172526 0.658809
H  -2.567499 0.438341 1.611213
H  -3.687472 1.791736 1.556686
H  -2.845528 3.229745 -0.852708
H  -3.67099 -1.27074 -2.677267
H  -3.208325 2.938808 -3.261616
H  -3.603335 0.670059 -4.188784
H  -2.495615 -3.225489 0.465119
H  -6.968288 0.278117 1.632441
H  -6.944238 -1.491407 1.744533
H  -5.976968 -0.512819 2.872686
H  0.358974 -3.121303 -1.541007
H  -0.42162 -3.907569 -0.157126
H  -1.058189 -4.158717 -1.80053
elementType: O C H
totalener: -1459.13791601 hartree
nucrepener: 3229.21053075 hartree
electener: -4688.34844676 hartree
oneelecener: -8409.84876436 hartree
twoeener: 3721.50031760 hartree
cpcmener: -0.03978709 hartree
kineticenergy: 1452.83395415 hartree
xcener: -140.267931490702 hartree
chargesum: -0.0000000
charge: -0.243510 -0.321816 -0.475351 -0.283677 -0.284886 -0.490119 -0.136194 0.038249 -0.128240 -0.014297 -0.042752 -0.108555 0.090989 0.372081 -0.287736 -0.096180 -0.109431 0.296812 -0.266020 -0.283690 0.085629 -0.137826 0.065562 -0.148469 -0.212397 -0.181356 -0.165611 -0.154334 0.486360 0.264599 -0.140430 -0.120924 0.090873 0.096926 0.084619 0.077968 0.068378 0.059142 0.117188 0.097284 0.115387 0.153707 0.107764 0.136598 0.081480 0.093931 0.080526 0.128929 0.124622 0.138875 0.143020 0.157264 0.155893 0.106665 0.124011 0.120366 0.116763 0.113561 0.113707 0.128073
qa: -0.2435 -0.3218 -0.4754 -0.2837 -0.2849 -0.4901 -0.1362 0.0382 -0.1282 -0.0143 -0.0428 -0.1086 0.0910 0.3721 -0.2877 -0.0962 -0.1094 0.2968 -0.2660 -0.2837 0.0856 -0.1378 0.0656 -0.1485 -0.2124 -0.1814 -0.1656 -0.1543 0.4864 0.2646 -0.1404 -0.1209 0.0909 0.0969 0.0846 0.0780 0.0684 0.0591 0.1172 0.0973 0.1154 0.1537 0.1078 0.1366 0.0815 0.0939 0.0805 0.1289 0.1246 0.1389 0.1430 0.1573 0.1559 0.1067 0.1240 0.1204 0.1168 0.1136 0.1137 0.1281
va: 2.2054 2.0891 2.0381 2.1192 2.1218 2.0263 3.8215 3.4466 3.8522 3.7518 3.7507 3.8830 4.1709 4.2517 3.9476 3.8902 3.8041 3.8066 4.0616 3.9294 3.7922 3.6378 3.4689 3.8997 3.9836 3.4626 3.9150 3.9032 4.1213 3.9075 3.8753 3.8524 1.0228 0.9987 1.0203 1.0078 1.0076 1.0086 0.9921 1.0076 0.9949 0.9937 1.0347 1.0153 0.9979 1.0049 1.0002 0.9967 0.9916 1.0134 1.0071 0.9909 0.9917 1.0331 0.9958 0.9938 0.9930 1.0062 0.9894 0.9889
dispcorr: -0.032155618 hartree
energy: -1459.170071631516
dipole: 34.62610 -34.23860 0.38750 -1.55683 3.38193 1.82510 0.63114 -0.46058 0.17056
magnitude: 1.87356 au
magnitude: 4.76222 debye
