program: Orca
programVersion: 5.0.4
elementType: O O O O O O C C C C C C C C C C C C C C C C C C C C C C C C C C H H H H H H H H H H H H H H H H H H H H H H H H H H H H
charge: 0
multiplicity: 1
keywords: wb97x-d3
keywords: def2-TZVPP
keywords: def2/J RIJCOSX
keywords: DEFGRID2
keywords: scfconv7
keywords: smallprint printgap noloewdin
keywords: NOSOSCF
formula: C26H28O6
InChI: InChI=1/C26H28O6/c1-5-6-10-21-17(2)20-13-12-19(14-24(20)32-26(21)28)31-15-18-9-7-8-11-22(18)23(16-29-3)25(27)30-4/h7-9,11-14,16H,5-6,10,15H2,1-4H3
60 atoms
O  1.68397 -0.656759 -0.367805
O  -1.631445 2.21154 1.417208
O  3.086422 -2.062851 -1.257526
O  -5.08073 -0.708974 1.119512
O  -1.386042 -2.117594 -1.315068
O  -4.207909 -2.704451 1.616052
C  5.353029 -0.408606 -1.041209
C  3.984088 0.035427 -0.608384
C  6.054552 -1.315942 -0.024063
C  3.679841 1.248055 -0.071128
C  2.314813 1.531233 0.31874
C  6.361222 -0.642434 1.306459
C  1.352717 0.541853 0.156509
C  2.938416 -0.962841 -0.775952
C  4.688908 2.32628 0.156809
C  1.879791 2.748828 0.865291
C  0.02153 0.711355 0.506913
C  -0.375952 1.928206 1.037375
C  0.566427 2.951796 1.213624
C  7.078315 -1.572011 2.273892
C  -2.65951 1.257071 1.191578
C  -3.028868 1.139726 -0.266916
C  -3.314261 -0.095646 -0.860165
C  -3.111436 2.299576 -1.034095
C  -3.663106 -0.134088 -2.210458
C  -3.237132 -1.371018 -0.10817
C  -3.457454 2.247383 -2.374441
C  -3.733302 1.023614 -2.967128
C  -4.196819 -1.68826 0.954384
C  -2.306165 -2.304264 -0.386577
C  -6.052253 -0.865765 2.149566
C  -0.456398 -3.180085 -1.515515
H  5.269918 -0.942221 -1.990251
H  5.985729 0.454516 -1.246618
H  6.989075 -1.66572 -0.473155
H  5.451117 -2.211118 0.151174
H  6.975203 0.246931 1.132991
H  5.43458 -0.288974 1.767948
H  5.687597 2.056991 -0.169488
H  4.403694 3.239612 -0.368776
H  4.746343 2.575258 1.218125
H  2.584177 3.555129 1.017484
H  -0.660674 -0.111478 0.354075
H  0.251521 3.900381 1.629119
H  6.476465 -2.455525 2.49655
H  7.292546 -1.074933 3.22138
H  8.029111 -1.918709 1.863695
H  -2.380167 0.291888 1.622694
H  -3.508194 1.630205 1.766565
H  -2.899547 3.260738 -0.581708
H  -3.889521 -1.088393 -2.66997
H  -3.514211 3.160556 -2.952844
H  -4.004732 0.970322 -4.013581
H  -2.280307 -3.244923 0.159326
H  -6.66517 0.031339 2.120032
H  -6.686443 -1.735951 1.977361
H  -5.586088 -0.947431 3.132123
H  0.087458 -3.410173 -0.598429
H  -0.964568 -4.077665 -1.87153
H  0.245721 -2.845883 -2.274276
elementType: O C H
totalener: -1459.13849118 hartree
nucrepener: 3253.23809810 hartree
electener: -4712.37658927 hartree
oneelecener: -8457.78224462 hartree
twoeener: 3745.40565535 hartree
cpcmener: -0.03954457 hartree
kineticenergy: 1452.83123727 hartree
xcener: -140.267615116252 hartree
chargesum: -0.0000000
charge: -0.242305 -0.321933 -0.474223 -0.282793 -0.285981 -0.490308 -0.147849 0.055731 -0.127005 -0.055417 -0.024123 -0.081225 0.089172 0.380061 -0.288511 -0.092587 -0.123210 0.295095 -0.263318 -0.284021 0.085227 -0.139003 0.062007 -0.151254 -0.208092 -0.169254 -0.163546 -0.156920 0.492107 0.251538 -0.139523 -0.145037 0.095782 0.098770 0.074639 0.067837 0.056785 0.061979 0.098313 0.122186 0.117929 0.154055 0.119940 0.136539 0.079737 0.089902 0.079039 0.128394 0.124333 0.138520 0.142766 0.156996 0.156173 0.110039 0.123618 0.119978 0.116816 0.118972 0.135162 0.121300
qa: -0.2423 -0.3219 -0.4742 -0.2828 -0.2860 -0.4903 -0.1478 0.0557 -0.1270 -0.0554 -0.0241 -0.0812 0.0892 0.3801 -0.2885 -0.0926 -0.1232 0.2951 -0.2633 -0.2840 0.0852 -0.1390 0.0620 -0.1513 -0.2081 -0.1693 -0.1635 -0.1569 0.4921 0.2515 -0.1395 -0.1450 0.0958 0.0988 0.0746 0.0678 0.0568 0.0620 0.0983 0.1222 0.1179 0.1541 0.1199 0.1365 0.0797 0.0899 0.0790 0.1284 0.1243 0.1385 0.1428 0.1570 0.1562 0.1100 0.1236 0.1200 0.1168 0.1190 0.1352 0.1213
va: 2.2073 2.0885 2.0394 2.1196 2.1167 2.0283 3.8640 3.3865 3.8517 3.7148 3.7354 3.8536 4.1742 4.2264 3.9312 3.8846 3.8148 3.8089 4.0582 3.9595 3.7955 3.6461 3.4716 3.9053 3.9758 3.4475 3.9134 3.9039 4.1257 3.9265 3.8744 3.8491 1.0192 1.0041 1.0110 1.0190 1.0044 1.0016 1.0117 0.9958 0.9911 0.9930 1.0235 1.0152 1.0007 1.0030 1.0008 0.9957 0.9918 1.0137 1.0068 0.9909 0.9916 1.0303 0.9956 0.9942 0.9928 0.9904 0.9887 0.9992
dispcorr: -0.032900150 hartree
energy: -1459.171391327108
dipole: 31.16087 -30.71859 0.44229 -1.97861 3.99132 2.01271 6.01156 -5.70870 0.30287
magnitude: 2.08287 au
magnitude: 5.29422 debye
