program: Orca
programVersion: 5.0.4
elementType: O O O O O O C C C C C C C C C C C C C C C C C C C C C C C C C C H H H H H H H H H H H H H H H H H H H H H H H H H H H H
charge: 0
multiplicity: 1
keywords: wb97x-d3
keywords: def2-TZVPP
keywords: def2/J RIJCOSX
keywords: DEFGRID2
keywords: scfconv7
keywords: smallprint printgap noloewdin
keywords: NOSOSCF
formula: C26H28O6
InChI: InChI=1/C26H28O6/c1-5-6-10-21-17(2)20-13-12-19(14-24(20)32-26(21)28)31-15-18-9-7-8-11-22(18)23(16-29-3)25(27)30-4/h7-9,11-14,16H,5-6,10,15H2,1-4H3
60 atoms
O  1.687382 -0.654835 -0.348945
O  -1.631675 2.198108 1.453306
O  3.086585 -2.047527 -1.264553
O  -5.124072 -0.666686 1.077894
O  -1.371308 -2.168742 -1.207881
O  -4.314501 -2.678414 1.614127
C  5.335981 -0.361833 -1.113408
C  3.973268 0.064075 -0.644006
C  6.077879 -1.262681 -0.119805
C  3.667841 1.273314 -0.099966
C  2.308189 1.542564 0.317477
C  6.405201 -0.592682 1.207431
C  1.353242 0.543182 0.175029
C  2.935536 -0.94642 -0.786273
C  4.669618 2.363031 0.104432
C  1.870843 2.757732 0.867164
C  0.025654 0.702989 0.542799
C  -0.376094 1.920367 1.068769
C  0.560327 2.951378 1.231497
C  7.164976 -1.515135 2.148663
C  -2.660076 1.24889 1.208141
C  -2.994686 1.127082 -0.258344
C  -3.281266 -0.109135 -0.848749
C  -3.034826 2.280711 -1.037958
C  -3.583966 -0.155932 -2.209879
C  -3.253537 -1.377113 -0.08109
C  -3.335928 2.220504 -2.388876
C  -3.608639 0.995169 -2.979627
C  -4.255482 -1.66508 0.950638
C  -2.330469 -2.329886 -0.314904
C  -6.141167 -0.800865 2.06629
C  -0.454203 -3.249112 -1.362171
H  5.233817 -0.893656 -2.061671
H  5.951222 0.510346 -1.333233
H  7.007211 -1.592251 -0.594216
H  5.495272 -2.169849 0.063951
H  6.997508 0.309602 1.025489
H  5.483871 -0.260725 1.694768
H  4.743584 2.618099 1.163263
H  5.664897 2.102006 -0.238361
H  4.365438 3.270634 -0.420364
H  2.570311 3.570632 1.006239
H  -0.651472 -0.126427 0.402936
H  0.242385 3.899398 1.64591
H  7.392396 -1.021976 3.095091
H  8.112093 -1.838498 1.711844
H  6.587053 -2.412835 2.377983
H  -2.395965 0.283212 1.648006
H  -3.51889 1.629009 1.762945
H  -2.822431 3.242645 -0.58744
H  -3.809202 -1.111284 -2.667795
H  -3.359041 3.128798 -2.977199
H  -3.843304 0.935478 -4.034613
H  -2.343626 -3.265191 0.240681
H  -5.718787 -0.886284 3.06816
H  -6.735612 0.107164 2.007205
H  -6.783123 -1.66025 1.870605
H  0.047387 -3.481665 -0.422243
H  -0.963046 -4.140054 -1.732309
H  0.284918 -2.934913 -2.093043
elementType: O C H
totalener: -1459.13838368 hartree
nucrepener: 3254.31525671 hartree
electener: -4713.45364040 hartree
oneelecener: -8459.94948415 hartree
twoeener: 3746.49584375 hartree
cpcmener: -0.03960528 hartree
kineticenergy: 1452.83591263 hartree
xcener: -140.268599177878 hartree
chargesum: 0.0000000
charge: -0.242450 -0.322355 -0.474056 -0.282877 -0.285873 -0.490519 -0.149199 0.057736 -0.126635 -0.054259 -0.023052 -0.082074 0.093207 0.378688 -0.288642 -0.092380 -0.125112 0.290333 -0.260220 -0.283975 0.084773 -0.141108 0.062992 -0.149372 -0.209075 -0.171767 -0.163766 -0.156244 0.493641 0.252318 -0.139618 -0.146388 0.095902 0.098639 0.074715 0.067818 0.056602 0.062590 0.117707 0.098140 0.122511 0.153915 0.119048 0.136482 0.089928 0.079311 0.079685 0.128522 0.123888 0.138882 0.142715 0.157052 0.156229 0.109758 0.116803 0.123620 0.119881 0.121655 0.135320 0.120011
qa: -0.2424 -0.3224 -0.4741 -0.2829 -0.2859 -0.4905 -0.1492 0.0577 -0.1266 -0.0543 -0.0231 -0.0821 0.0932 0.3787 -0.2886 -0.0924 -0.1251 0.2903 -0.2602 -0.2840 0.0848 -0.1411 0.0630 -0.1494 -0.2091 -0.1718 -0.1638 -0.1562 0.4936 0.2523 -0.1396 -0.1464 0.0959 0.0986 0.0747 0.0678 0.0566 0.0626 0.1177 0.0981 0.1225 0.1539 0.1190 0.1365 0.0899 0.0793 0.0797 0.1285 0.1239 0.1389 0.1427 0.1571 0.1562 0.1098 0.1168 0.1236 0.1199 0.1217 0.1353 0.1200
va: 2.2075 2.0876 2.0396 2.1196 2.1168 2.0281 3.8658 3.3817 3.8512 3.7144 3.7327 3.8538 4.1682 4.2288 3.9306 3.8837 3.8127 3.8111 4.0564 3.9592 3.7952 3.6466 3.4708 3.9021 3.9778 3.4511 3.9137 3.9040 4.1238 3.9280 3.8748 3.8486 1.0189 1.0041 1.0109 1.0192 1.0045 1.0016 0.9912 1.0118 0.9957 0.9931 1.0246 1.0152 1.0030 1.0007 1.0006 0.9955 0.9921 1.0134 1.0069 0.9909 0.9916 1.0305 0.9928 0.9956 0.9941 0.9887 0.9886 1.0009
dispcorr: -0.032920221 hartree
energy: -1459.171303904295
dipole: 31.34676 -30.89191 0.45485 -1.72559 3.73326 2.00767 5.38255 -5.09197 0.29058
magnitude: 2.07896 au
magnitude: 5.28429 debye
