program: Gaussian 09
title: 000069389
version: EM64L-G09RevD.01
frameworkgroup: C1[X(C4H8O)]
method: RPBEPBE
basis: SDD
operation: Freq
keyword: #p
keyword: freq=noraman
keyword: PBEPBE/SDD
title: #p freq=noraman PBEPBE/SDD
converged: YES YES NO NO
title: Mulliken charges:
elementType: O C C C C H H H H H H H H
charge: -0.432864 -0.507267 -0.300187 0.020167 -0.588313 0.211774 0.211495 0.211421 0.195269 0.213171 0.333711 0.218455 0.213167
chargesum: 0.00000
title: Mulliken charges with hydrogens summed into heavy atoms:
elementType: O C C C C
charge: -0.099153 -0.083997 0.106503 0.233338 -0.156691
polarizability: 5.41690864e+01 -9.76940713e+00 4.11731868e+01 -4.17735640e+00 2.42501100e+00 4.22448029e+01
1716.lowfreq: -18.6686 -0.0010 -0.0010 -0.0009 11.0799 20.6025 78.2503 106.2046 233.7185
frequency: 78.1269 106.1791 233.6881 268.5204 394.1279 468.9349 625.7646 832.1336 859.4194 940.7030 960.6015 981.1763 1005.1578 1055.2973 1090.3792 1197.1063 1220.2198 1287.1312 1307.4905 1333.9869 1378.9459 1428.7638 1448.9506 1477.8290 1661.0086 2946.1288 2963.1061 3012.3192 3064.3643 3082.1760 3095.2459 3195.4476 3563.3618
redmass: 2.5811 1.8155 1.5715 1.6351 2.0637 2.3045 1.3918 2.6459 1.8808 1.3348 1.3264 1.7129 1.2304 3.7686 1.2388 1.6325 1.2070 1.2348 1.2849 1.3183 1.2113 1.1817 1.1085 1.0831 4.7566 1.0637 1.0658 1.0983 1.0957 1.0649 1.0892 1.1141 1.0662
irintensity: 0.6012 9.9393 123.4658 45.2746 2.2327 11.3263 13.7604 10.0077 18.6073 52.3609 54.9180 39.8684 1.8013 26.5071 32.8768 3.8520 2.8553 1.1325 8.6262 3.7094 22.8131 3.0728 18.5223 1.9036 15.2122 27.4507 101.2335 17.8637 37.0028 28.2590 9.0362 29.5957 4.7034
temp: 298.150 k
press: 1.00000 atm
elementType: 8 6 6 6 6 1 1 1 1 1 1 1 1
symmnumber: 1
zpe: 290476.0 jmol-1
zpe.correction: 0.110636 hartree
zpe.thermalcorrener: 0.117096 hartree
zpe.thermalcorrenthalpy: 0.118040 hartree
zpe.thermalcorrgfe: 0.080664 hartree
zpe.sumelectzpe: -231.990018 hartree
zpe.sumelectthermal: -231.983559 hartree
zpe.sumelectthermalent: -231.982614 hartree
zpe.sumelectthermalfe: -232.019991 hartree
dipole: 0.6939 1.4301 -1.3027
dipole: 2.0552
quadrupole: -35.0512 -32.6172 -28.2911
quadrupole: -4.2098 1.9630 2.5586
quadrupole: -3.0647 -0.6307 3.6954 -4.2098 1.9630 2.5586
hfenergy: -232.1006546 hartree
pointgroup: C01 [X(C4H8O1)]
dipole: -0.2778044 -0.552231 -0.5212068 debye
dipolederiv: -0.6753073 -0.0780309 0.1215488 -0.1414128 -0.7586221 0.0063519 0.1535366 0.0492519 -0.1770944 -0.1398968 -0.0213083 -0.0032808 0.0554806 0.0224822 -0.0493042 -0.0502458 -0.0495488 0.0855855 0.4731098 0.0593712 -0.0373204 0.0551597 0.6853988 -0.0313598 -0.0031936 -0.0828369 0.2886991 0.1071203 -0.1778892 -0.0087679 -0.2421051 -0.0701312 0.0130176 -0.1029318 0.0315104 0.1600219 -0.2798922 -0.1264157 -0.0434291 -0.1028768 -0.3424179 0.0317465 -0.0519448 0.0455012 0.090015 0.0198042 0.0007295 0.0059148 0.0153539 -0.1796893 0.0157655 0.0449539 0.029472 0.0989793 0.0165609 0.0067808 -0.025874 0.0189642 0.0829685 0.0774486 0.0120454 0.014026 -0.1698186 0.0748506 -0.0217507 -0.0032616 -0.017241 0.0151677 0.0349407 -0.0515767 0.076846 -0.1449986 -0.1443564 0.110032 0.0762032 0.0834309 -0.122976 -0.0579383 0.1159771 -0.1087494 -0.0019707 0.0753695 0.0487918 -0.0329713 0.0617235 0.1181887 0.0042863 0.0163385 -0.0106395 -0.1396964 0.3650006 0.0327674 -0.1382472 0.0290564 0.2685576 0.0068923 -0.1426993 0.0460103 0.0228611 -0.0030487 0.1186218 0.0733171 0.1366969 0.1249147 -0.0444243 0.0810106 -0.0517055 0.0212101 0.1106854 0.0483003 0.0161684 0.0477698 0.1561584 -0.007423 -0.0212701 0.0108623 -0.1337934 unknown
polarizability: 53.6116652|-10.0424839|41.6521268|4.2058635|-2.6680494|42.3232841 unknown
InChI: InChI=1S/C4H8O/c1-2-3-4-5/h2,5H,1,3-4H2
charge 0 multiplicity 1
13 atoms
O  1.753522 0.97342 0.023759
C  0.062961 -0.86017 -0.351576
C  1.480305 -0.465939 0.123929
C  -1.045412 -0.145208 0.393348
C  -2.086784 0.500087 -0.188205
H  -0.037979 -1.957293 -0.205149
H  -0.037233 -0.678053 -1.440989
H  1.604036 -0.693997 1.196976
H  2.236088 -1.049317 -0.445387
H  -0.974636 -0.168621 1.491955
H  1.456068 1.297936 -0.863569
H  -2.863902 0.99086 0.408039
H  -2.193135 0.556396 -1.279231
